ID,"Collection / Source","Catalog Number","Specify Number",Taxon,"Common Name",State,County,Date,Time,Locale,Latitude,Longitude,Collector,"Life Stage","Collection Method","Preparation Type",Count,Temperature,Humidity,"Dew Point",Wind,"Wind Direction","Barometric Pressure",Sky,"Moon Phase",Notes
137470,,2016-002013,,"Conoderus bellus",None,Iowa,Johnson,2014-08-25,,Redacted,Redacted,Redacted,"Mark Brown",adult,,Photograph,1,,,,,,,,,
137622,,2016-002165,,"Conoderus vespertinus","Tobacco Wireworm",Iowa,Johnson,2013-07-08,,Redacted,Redacted,Redacted,"Mark Brown",adult,,Photograph,1,,,,,,,,,
137810,,2016-002354,,"Conoderus vespertinus","Tobacco Wireworm",Iowa,Johnson,2011-07-05,,"Iowa City",41.667,-91.545,"Mark Brown",adult,,Photograph,1,,,,,,,,,
137862,,2016-002406,,"Conoderus lividus",None,Iowa,Johnson,2010-06-19,,"Iowa City",41.667,-91.545,"Mark Brown",adult,,Photograph,1,,,,,,,,,
279325,,,,"Conoderus vespertinus","Tobacco Wireworm",Iowa,Johnson,2020-07-15,,Redacted,Redacted,Redacted,"Mark Brown",adult,Sighting,Photograph,1,,,,,,,,,
295497,,,,"Conoderus vespertinus","Tobacco Wireworm",Iowa,Johnson,2021-06-30,23:55:07,Redacted,Redacted,Redacted,"Mark Brown",adult,Sighting,Photograph,1,,,,,,,,,
296311,,,,"Conoderus bellus",None,Iowa,Johnson,2021-06-28,6:39:25,Redacted,Redacted,Redacted,"Mark Brown",adult,Sighting,Photograph,1,,,,,,,,,
315667,,,,"Conoderus bellus",None,Iowa,Johnson,2022-06-21,23:39:34,Redacted,Redacted,Redacted,"Mark Brown",adult,Sighting,Photograph,1,,,,,,,,,
319548,,,,"Conoderus auritus",None,Iowa,Johnson,2022-07-07,22:16:59,Redacted,Redacted,Redacted,"Mark Brown",adult,Sighting,Photograph,1,,,,,,,,,
320370,,,,"Conoderus bellus",None,Iowa,Johnson,2022-07-14,22:34:17,Redacted,Redacted,Redacted,"Mark Brown",adult,Sighting,Photograph,1,,,,,,,,,
320747,,,,"Conoderus vespertinus","Tobacco Wireworm",Iowa,Johnson,2022-07-20,22:07:06,Redacted,Redacted,Redacted,"Mark Brown",adult,Sighting,Photograph,1,,,,,,,,,
332106,,,,"Conoderus bellus",None,Iowa,Johnson,2022-08-28,22:35:57,Redacted,Redacted,Redacted,"Mark Brown",adult,Sighting,Photograph,1,,,,,,,,,
332170,,,,"Conoderus bellus",None,Iowa,Johnson,2022-08-24,21:48:16,Redacted,Redacted,Redacted,"Mark Brown",adult,Sighting,Photograph,1,,,,,,,,,
332412,,,,"Conoderus bellus",None,Iowa,Johnson,2022-08-07,00:27:25,Redacted,Redacted,Redacted,"Mark Brown",adult,Sighting,Photograph,1,,,,,,,,,
332651,,,,"Conoderus bellus",None,Iowa,Johnson,2022-09-16,20:57:26,Redacted,Redacted,Redacted,"Mark Brown",adult,Sighting,Photograph,1,,,,,,,,,
343344,,,,"Conoderus vespertinus","Tobacco Wireworm",Iowa,Johnson,2023-06-30,23:06:54,Redacted,Redacted,Redacted,"Mark Brown",adult,,Photograph,1,,,,,,,,,
345133,,,,"Conoderus lividus",None,Iowa,Johnson,2023-07-23,22:52:24,Redacted,Redacted,Redacted,"Mark Brown",adult,Sighting,Photograph,1,,,,,,,,,
347565,,,,"Conoderus bellus",None,Iowa,Johnson,2023-08-21,22:26:00,Redacted,Redacted,Redacted,"Mark Brown",adult,Sighting,Photograph,1,,,,,,,,,
347621,,,,"Conoderus bellus",None,Iowa,Johnson,2023-08-19,23:14:13,Redacted,Redacted,Redacted,"Mark Brown",adult,Sighting,Photograph,1,,,,,,,,,
347700,,,,"Conoderus bellus",None,Iowa,Johnson,2023-08-10,22:37:02,Redacted,Redacted,Redacted,"Mark Brown",adult,Sighting,Photograph,1,,,,,,,,,
