ID,"Collection / Source","Catalog Number","Specify Number",Taxon,"Common Name",State,County,Date,Time,Locale,Latitude,Longitude,Collector,"Life Stage","Collection Method","Preparation Type",Count,Temperature,Humidity,"Dew Point",Wind,"Wind Direction","Barometric Pressure",Sky,"Moon Phase",Notes
1763,,2014-002044,,"Ancyloxypha numitor","Least Skipper",Iowa,Howard,1950-08-01,,"Howard County",43.38195,-92.381363," USGS - NPWRC",adult,Sighting,Sighting,1,,,,,,,,,"HIstorical Record"
50441,,2014-050823,,"Ancyloxypha numitor","Least Skipper",Iowa,Howard,2003-08-13,,"Crossman Prairie State Preserve",43.408885,-92.474737,"Frank Olsen",adult,Sighting,Sighting,1,,,,,,,,,
50442,,2014-050824,,"Ancyloxypha numitor","Least Skipper",Iowa,Howard,2004-08-14,,"Crossman Prairie State Preserve",43.408885,-92.474737,"Frank Olsen",adult,Sighting,Sighting,2,,,,,,,,,
50443,,2014-050825,,"Ancyloxypha numitor","Least Skipper",Iowa,Howard,2005-06-16,,"Crossman Prairie State Preserve",43.408885,-92.474737,"Frank Olsen",adult,Sighting,Sighting,1,,,,,,,,,
50444,,2014-050826,,"Ancyloxypha numitor","Least Skipper",Iowa,Howard,2006-06-23,,"Crossman Prairie State Preserve",43.408885,-92.474737,"Frank Olsen",adult,Sighting,Sighting,3,,,,,,,,,
50457,,2014-050839,,"Ancyloxypha numitor","Least Skipper",Iowa,Howard,2003-08-13,,"Hayden Prairie State Wildlife Management Area",43.44055,-92.38058,"Frank Olsen",adult,Sighting,Sighting,1,,,,,,,,,
50458,,2014-050840,,"Ancyloxypha numitor","Least Skipper",Iowa,Howard,2005-06-22,,"Hayden Prairie State Wildlife Management Area",43.44055,-92.38058,"Frank Olsen",adult,Sighting,Sighting,1,,,,,,,,,
50459,,2014-050841,,"Ancyloxypha numitor","Least Skipper",Iowa,Howard,2006-06-23,,"Hayden Prairie State Wildlife Management Area",43.44055,-92.38058,"Frank Olsen",adult,Sighting,Sighting,1,,,,,,,,,
50460,,2014-050842,,"Ancyloxypha numitor","Least Skipper",Iowa,Howard,2005-06-22,,"Hayden Prairie State Wildlife Management Area",43.44055,-92.38058,"Frank Olsen",adult,Sighting,Sighting,1,,,,,,,,,
50461,,2014-050843,,"Ancyloxypha numitor","Least Skipper",Iowa,Howard,1996-06-27,,"Hayden Prairie State Wildlife Management Area",43.44055,-92.38058,"Kirk Larsen",adult,Sighting,Sighting,1,,,,,,,,,
248108,,,,"Ancyloxypha numitor","Least Skipper",Iowa,Howard,2004-08-29,1135-1535,"Hayden Prairie State Wildlife Management Area",43.44055,-92.38058,"Frank Olsen",adult,Sighting,Sighting,1," 67-70",,,0-3,,," mostly cloudy",,
273262,,,,"Ancyloxypha numitor","Least Skipper",Iowa,Howard,2020-07-02,,"Crossman Prairie State Preserve",43.408885,-92.474737,"Frank Olsen",adult,Sighting,Sighting,1,,,,,,,,,"1455-1540, sunny, 86, E 0-4"
300598,,,,"Ancyloxypha numitor","Least Skipper",Iowa,Howard,2021-06-19,,"Turkey River, King's Bridge",43.328212,-92.101674,"Jay Gilliam",adult,Sighting,Sighting,8,,,,,,,,,
355655,,,,"Ancyloxypha numitor","Least Skipper",Iowa,Howard,1996-06-27,,"Hayden Prairie State Wildlife Management Area",43.441667,-92.383333,"Kirk J. Larsen",adult,,,1,,,,,,,,,"Data from Kirk Larsen, Luther College"
