ID,"Collection / Source","Catalog Number","Specify Number",Taxon,"Common Name",State,County,Date,Time,Locale,Latitude,Longitude,Collector,"Life Stage","Collection Method","Preparation Type",Count,Temperature,Humidity,"Dew Point",Wind,"Wind Direction","Barometric Pressure",Sky,"Moon Phase",Notes
2123,,2014-002404,,"Callophrys gryneus","Olive or Juniper Hairstreak",Iowa,Fremont,1950-05-15,,Sidney,40.74004,-95.645798," USGS - NPWRC",adult,Sighting,Sighting,1,,,,,,,,,"HIstorical Record"
2142,,2014-002423,,"Callophrys henrici","Henry's Elfin",Iowa,Fremont,1950-04-28,,Sidney,40.74004,-95.645798," USGS - NPWRC",adult,Sighting,Sighting,1,,,,,,,,,"HIstorical Record"
2195,,2014-002476,,"Celastrina neglecta","Summer Azure",Iowa,Fremont,1950-06-15,,Sidney,40.74004,-95.645798," USGS - NPWRC",adult,Sighting,Sighting,1,,,,,,,,,"HIstorical Record"
2801,,2014-003082,,"Echinargus isola","Reakirt's Blue",Iowa,Fremont,1950-07-15,,Sidney,40.74004,-95.645798," USGS - NPWRC",adult,Sighting,Sighting,1,,,,,,,,,"HIstorical Record"
3405,,2014-003686,,"Cupido comyntas","Eastern-tailed Blue",Iowa,Fremont,1950-08-01,,Sidney,40.74004,-95.645798," USGS - NPWRC",adult,Sighting,Sighting,1,,,,,,,,,"HIstorical Record"
3468,,2014-003749,,"Feniseca tarquinius",Harvester,Iowa,Fremont,1950-08-01,,Sidney,40.74004,-95.645798," USGS - NPWRC",adult,Sighting,Sighting,1,,,,,,,,,"HIstorical Record"
3693,,2014-003974,,"Leptotes marina","Marine Blue",Iowa,Fremont,1950-06-15,,Sidney,40.74004,-95.645798," USGS - NPWRC",adult,Sighting,Sighting,1,,,,,,,,,"HIstorical Record"
3998,,2014-004279,,"Tharsalea dione","Gray Copper",Iowa,Fremont,1950-07-01,,Sidney,40.74004,-95.645798," USGS - NPWRC",adult,Sighting,Sighting,1,,,,,,,,,"HIstorical Record"
4082,,2014-004363,,"Tharsalea hyllus","Bronze Copper",Iowa,Fremont,1950-08-01,,Sidney,40.74004,-95.645798," USGS - NPWRC",adult,Sighting,Sighting,1,,,,,,,,,"HIstorical Record"
4638,,2014-004919,,"Parrhasius m-album","White-M Hairstreak",Iowa,Fremont,1950-05-01,,Sidney,40.74004,-95.645798," USGS - NPWRC",adult,Sighting,Sighting,1,,,,,,,,,"HIstorical Record"
5645,,2014-005926,,"Satyrium calanus","Banded Hairstreak",Iowa,Fremont,1950-07-01,,Sidney,40.74004,-95.645798," USGS - NPWRC",adult,Sighting,Sighting,1,,,,,,,,,"HIstorical Record"
5683,,2014-005964,,"Satyrium caryaevorus","Hickory Hairstreak",Iowa,Fremont,1950-07-01,,Redacted,Redacted,Redacted," USGS - NPWRC",adult,Sighting,Sighting,1,,,,,,,,,"HIstorical Record"
5684,,2014-005965,,"Satyrium caryaevorus","Hickory Hairstreak",Iowa,Fremont,2013-07-06,,Redacted,Redacted,Redacted," BAMONA",adult,Sighting,Sighting,1,,,,,,,,,
5717,,2014-005998,,"Satyrium liparops","Striped Hairstreak",Iowa,Fremont,1950-07-01,,Redacted,Redacted,Redacted," USGS - NPWRC",adult,Sighting,Sighting,1,,,,,,,,,"HIstorical Record"
5755,,2014-006036,,"Satyrium titus","Coral Hairstreak",Iowa,Fremont,1950-07-01,,Sidney,40.74004,-95.645798," USGS - NPWRC",adult,Sighting,Sighting,1,,,,,,,,,"HIstorical Record"
6068,,2014-006349,,"Strymon melinus","Gray Hairstreak",Iowa,Fremont,1950-08-15,,Sidney,40.74004,-95.645798," USGS - NPWRC",adult,Sighting,Sighting,1,,,,,,,,,"HIstorical Record"
6564,,2014-006845,,"Celastrina ladon","Spring Azure",Iowa,Fremont,2010-05-29,,"Waubonsie State Park",40.676,-95.689,"Aaron Brees",adult,Sighting,Sighting,1,,,,,,,,,
7478,,2014-007759,,"Strymon melinus","Gray Hairstreak",Iowa,Fremont,2010-05-29,,"Waubonsie State Park",40.676,-95.689,"Aaron Brees",adult,Sighting,Photograph,3,,,,,,,,,
7834,,2014-008115,,"Celastrina neglecta","Summer Azure",Iowa,Fremont,2013-07-06,,"Waubonsie State Park",40.676,-95.689,"Tom Jantscher",adult,Sighting,Sighting,1,,,,,,,,,
8543,,2014-008824,,"Cupido comyntas","Eastern-tailed Blue",Iowa,Fremont,2013-07-06,,"Waubonsie State Park",40.676,-95.689,"Tom Jantscher",adult,Sighting,Sighting,1,,,,,,,,,
8544,,2014-008825,,"Cupido comyntas","Eastern-tailed Blue",Iowa,Fremont,2013-07-06,,"Waubonsie State Park",40.676,-95.689,"Tom Jantscher",adult,Sighting,Sighting,1,,,,,,,,,
8545,,2014-008826,,"Cupido comyntas","Eastern-tailed Blue",Iowa,Fremont,2012-09-09,,"Waubonsie State Park",40.676,-95.689,"Tom Jantscher",adult,Sighting,Sighting,1,,,,,,,,,
8546,,2014-008827,,"Cupido comyntas","Eastern-tailed Blue",Iowa,Fremont,2012-09-09,,"Waubonsie State Park",40.676,-95.689,"Tom Jantscher",adult,Sighting,Sighting,1,,,,,,,,,
8547,,2014-008828,,"Cupido comyntas","Eastern-tailed Blue",Iowa,Fremont,2012-09-09,,"Waubonsie State Park",40.676,-95.689,"Tom Jantscher",adult,Sighting,Sighting,1,,,,,,,,,
10010,,2014-010291,,"Satyrium caryaevorus","Hickory Hairstreak",Iowa,Fremont,2013-07-06,,Redacted,Redacted,Redacted,"Tom Jantscher",adult,Sighting,Sighting,1,,,,,,,,,
10153,,2014-010434,,"Strymon melinus","Gray Hairstreak",Iowa,Fremont,2012-09-09,,"Waubonsie State Park",40.676,-95.689,"Tom Jantscher",adult,Sighting,Sighting,1,,,,,,,,,
10154,,2014-010435,,"Strymon melinus","Gray Hairstreak",Iowa,Fremont,2012-09-09,,"Waubonsie State Park",40.676,-95.689,"Tom Jantscher",adult,Sighting,Sighting,1,,,,,,,,,
51355,,2014-051737,,"Callophrys henrici","Henry's Elfin",Iowa,Fremont,1962-04-29,,"Waubonsie State Park",40.676,-95.689,"Ron Royer",adult,Sighting,Sighting,2,,,,,,,,,
51501,,2014-051883,,"Celastrina ladon","Spring Azure",Iowa,Fremont,2003-04-22,,"Waubonsie State Park",40.676,-95.689,"Frank Olsen",adult,Sighting,Sighting,1,,,,,,,,,
51785,,2014-052167,,"Celastrina neglecta","Summer Azure",Iowa,Fremont,2003-09-07,,"Waubonsie State Park",40.676,-95.689,"Frank Olsen",adult,Sighting,Sighting,1,,,,,,,,,
51786,,2014-052168,,"Celastrina neglecta","Summer Azure",Iowa,Fremont,2010-07-02,,"Waubonsie State Park",40.676,-95.689,"Frank Olsen",adult,Sighting,Sighting,17,,,,,,,,,
51787,,2014-052169,,"Celastrina neglecta","Summer Azure",Iowa,Fremont,2005-09-14,,"Waubonsie State Park",40.676,-95.689,"Frank Olsen",adult,Sighting,Sighting,1,,,,,,,,,
51788,,2014-052170,,"Celastrina neglecta","Summer Azure",Iowa,Fremont,2009-09-06,,"Waubonsie State Park",40.676,-95.689,"Frank Olsen",adult,Sighting,Sighting,1,,,,,,,,,
56549,,2014-056931,,"Cupido comyntas","Eastern-tailed Blue",Iowa,Fremont,2011-10-04,,"Waubonsie State Park",40.676,-95.689,"Ed Freese",adult,Sighting,Sighting,1,,,,,,,,,
56550,,2014-056932,,"Cupido comyntas","Eastern-tailed Blue",Iowa,Fremont,2012-04-01,,"Waubonsie State Park",40.676,-95.689,"Ed Freese",adult,Sighting,Sighting,1,,,,,,,,,
56551,,2014-056933,,"Cupido comyntas","Eastern-tailed Blue",Iowa,Fremont,2009-09-06,,"Waubonsie State Park",40.676,-95.689,"Frank Olsen",adult,Sighting,Sighting,2,,,,,,,,,
56552,,2014-056934,,"Cupido comyntas","Eastern-tailed Blue",Iowa,Fremont,2013-09-02,,"Waubonsie State Park",40.676,-95.689,"Frank Olsen",adult,Sighting,Sighting,24,,,,,,,,,
56553,,2014-056935,,"Cupido comyntas","Eastern-tailed Blue",Iowa,Fremont,2010-07-02,,"Waubonsie State Park",40.676,-95.689,"Frank Olsen",adult,Sighting,Sighting,3,,,,,,,,,
56554,,2014-056936,,"Cupido comyntas","Eastern-tailed Blue",Iowa,Fremont,2003-09-07,,"Waubonsie State Park",40.676,-95.689,"Frank Olsen",adult,Sighting,Sighting,4,,,,,,,,,
56555,,2014-056937,,"Cupido comyntas","Eastern-tailed Blue",Iowa,Fremont,2005-09-11,,"Waubonsie State Park",40.676,-95.689,"Frank Olsen",adult,Sighting,Sighting,1,,,,,,,,,
56556,,2014-056938,,"Cupido comyntas","Eastern-tailed Blue",Iowa,Fremont,2005-09-14,,"Waubonsie State Park",40.676,-95.689,"Frank Olsen",adult,Sighting,Sighting,1,,,,,,,,,
56631,,2014-057013,,"Feniseca tarquinius",Harvester,Iowa,Fremont,1988-07-11,,"Waubonsie State Park",40.676,-95.689,"Babs Padelford",adult,Sighting,Sighting,1,,,,,,,,,
56632,,2014-057014,,"Feniseca tarquinius",Harvester,Iowa,Fremont,1987-07-26,,"Waubonsie State Park",40.676,-95.689,"Babs Padelford",adult,Sighting,Sighting,1,,,,,,,,,
56633,,2014-057015,,"Feniseca tarquinius",Harvester,Iowa,Fremont,1990-07-22,,"Waubonsie State Park",40.676,-95.689,"Babs Padelford",adult,Sighting,Sighting,1,,,,,,,,,
56634,,2014-057016,,"Feniseca tarquinius",Harvester,Iowa,Fremont,1990-09-26,,"Waubonsie State Park",40.676,-95.689,"Babs Padelford",adult,Sighting,Sighting,1,,,,,,,,,
56635,,2014-057017,,"Feniseca tarquinius",Harvester,Iowa,Fremont,2010-07-02,,"Waubonsie State Park",40.676,-95.689,"Doug Veal",adult,Sighting,Sighting,1,,,,,,,,,
56636,,2014-057018,,"Feniseca tarquinius",Harvester,Iowa,Fremont,1988-07-11,,"Waubonsie State Park",40.676,-95.689," Opler",adult,Sighting,Sighting,1,,,,,,,,,
57150,,2014-057532,,"Leptotes marina","Marine Blue",Iowa,Fremont,1990-07-11,,"Waubonsie State Park",40.676,-95.689,"Babs Padelford",adult,Sighting,Sighting,1,,,,,,,,,
62174,,2014-062775,,"Satyrium calanus","Banded Hairstreak",Iowa,Fremont,2006-06-04,,"Waubonsie State Park",40.676,-95.689,"Doug Veal",adult,Sighting,Sighting,1,,,,,,,,,
62175,,2014-062776,,"Satyrium calanus","Banded Hairstreak",Iowa,Fremont,2006-06-04,,"Waubonsie State Park",40.676,-95.689,"Doug Veal",adult,Sighting,Sighting,1,,,,,,,,,
62176,,2014-062777,,"Satyrium calanus","Banded Hairstreak",Iowa,Fremont,1990-06-25,,"Waubonsie State Park",40.676,-95.689,"Tim Orwig",adult,Sighting,Sighting,1,,,,,,,,,
62177,,2014-062778,,"Satyrium calanus","Banded Hairstreak",Iowa,Fremont,1950-07-01,,"Waubonsie State Park",40.676,-95.689,"Tim Orwig",adult,Sighting,Sighting,1,,,,,,,,,"HIstorical Record"
63294,,2014-063895,,"Strymon melinus","Gray Hairstreak",Iowa,Fremont,2012-04-01,,"Waubonsie State Park",40.676,-95.689,"Ed Freese",adult,Sighting,Sighting,1,,,,,,,,,
63295,,2014-063896,,"Strymon melinus","Gray Hairstreak",Iowa,Fremont,2005-09-11,,"Waubonsie State Park",40.676,-95.689,"Frank Olsen",adult,Sighting,Sighting,2,,,,,,,,,
63296,,2014-063897,,"Strymon melinus","Gray Hairstreak",Iowa,Fremont,2009-09-06,,"Waubonsie State Park",40.676,-95.689,"Frank Olsen",adult,Sighting,Sighting,2,,,,,,,,,
63297,,2014-063898,,"Strymon melinus","Gray Hairstreak",Iowa,Fremont,2013-09-02,,"Waubonsie State Park",40.676,-95.689,"Frank Olsen",adult,Sighting,Sighting,7,,,,,,,,,
63298,,2014-063899,,"Strymon melinus","Gray Hairstreak",Iowa,Fremont,2003-09-07,,"Waubonsie State Park",40.676,-95.689,"Frank Olsen",adult,Sighting,Sighting,1,,,,,,,,,
63299,,2014-063900,,"Strymon melinus","Gray Hairstreak",Iowa,Fremont,2005-09-14,,"Waubonsie State Park",40.676,-95.689,"Frank Olsen",adult,Sighting,Sighting,1,,,,,,,,,
124928,,2015-015496,,"Strymon melinus","Gray Hairstreak",Iowa,Fremont,2010-08-05,,"Waubonsie State Park",40.676,-95.689,"Jim Durbin",adult,Sighting,Photograph,1,,,,,,,,,
127371,,2015-017961,,"Cupido comyntas","Eastern-tailed Blue",Iowa,Fremont,2010-08-05,,"Waubonsie State Park",40.676,-95.689,"Jim Durbin",adult,Sighting,Photograph,1,,,,,,,,,
127381,,2015-017971,,"Strymon melinus","Gray Hairstreak",Iowa,Fremont,2010-08-05,,"Waubonsie State Park",40.676,-95.689,"Jim Durbin",adult,Sighting,Photograph,1,,,,,,,,,
127382,,2015-017972,,"Strymon melinus","Gray Hairstreak",Iowa,Fremont,2010-08-05,,"Waubonsie State Park",40.676,-95.689,"Jim Durbin",adult,Sighting,Photograph,1,,,,,,,,,
131408,,2015-021999,,"Feniseca tarquinius",Harvester,Iowa,Fremont,2015-08-31,,"Waubonsie State Park",40.676,-95.689,"Frank Olsen",adult,Sighting,Sighting,1,80,,,6,180,,"partly sunny",,
131409,,2015-022000,,"Strymon melinus","Gray Hairstreak",Iowa,Fremont,2015-08-31,,"Waubonsie State Park",40.676,-95.689,"Frank Olsen",adult,Sighting,Sighting,1,80,,,6,180,,"partly sunny",,
131410,,2015-022001,,"Cupido comyntas","Eastern-tailed Blue",Iowa,Fremont,2015-08-31,,"Waubonsie State Park",40.676,-95.689,"Frank Olsen",adult,Sighting,Sighting,47,80,,,6,180,,"partly sunny",,
144211,,2016-008581,,"Cupido comyntas","Eastern-tailed Blue",Iowa,Fremont,1988-07-26,,"Waubonsie State Park",40.676,-95.689,"Frank Olsen",adult,Sighting,Photograph,1,,,,,,,,,
180829,,2016-045579,,"Cupido comyntas","Eastern-tailed Blue",Iowa,Fremont,2016-09-01,,"Waubonsie State Park",40.676,-95.689,"Frank Olsen",adult,Sighting,Sighting,4,,,,,,,,,
180830,,2016-045580,,"Celastrina neglecta","Summer Azure",Iowa,Fremont,2016-09-01,,"Waubonsie State Park",40.676,-95.689,"Frank Olsen",adult,Sighting,Sighting,7,,,,,,,,,
180845,,2016-045595,,"Strymon melinus","Gray Hairstreak",Iowa,Fremont,2016-09-01,,"Waubonsie State Park",40.676,-95.689,"Frank Olsen",adult,Sighting,Sighting,2,,,,,,,,,"Both condition 1"
180846,,2016-045596,,"Cupido comyntas","Eastern-tailed Blue",Iowa,Fremont,2016-09-01,,"Waubonsie State Park",40.676,-95.689,"Frank Olsen",adult,Sighting,Sighting,4,,,,,,,,,
180847,,2016-045597,,"Celastrina neglecta","Summer Azure",Iowa,Fremont,2016-09-01,,"Waubonsie State Park",40.676,-95.689,"Frank Olsen",adult,Sighting,Sighting,3,,,,,,,,,
180862,,2016-045612,,"Cupido comyntas","Eastern-tailed Blue",Iowa,Fremont,2016-09-01,,"Waubonsie State Park",40.676,-95.689,"Frank Olsen",adult,Sighting,Sighting,5,,,,,,,,,
201923,,2018-000069,,"Echinargus isola","Reakirt's Blue",Iowa,Fremont,2017-09-12,,"Waubonsie State Park",40.676,-95.689,"Jacob Newton",adult,Sighting,Photograph,1,,,,,,,,,
224134,,2018-022289,,"Strymon melinus","Gray Hairstreak",Iowa,Fremont,2018-09-13,,"Waubonsie State Park",40.676,-95.689,"Frank Olsen",adult,Sighting,Sighting,1,,,,,,,,,"1120, cloudy, 71, S 1-7"
227913,,2019-002635,,"Cupido comyntas","Eastern-tailed Blue",Iowa,Fremont,2009-08-05,,"Waubonsie State Park",40.676,-95.689,"Jim Durbin",adult,Sighting,Photograph,1,,,,,,,,,
240947,,,,"Cupido comyntas","Eastern-tailed Blue",Iowa,Fremont,2019-08-27,1205-1220,"Waubonsie State Park",40.676,-95.689,"Frank Olsen",adult,Sighting,Sighting,4," 73-74",,,0-6,270,," 90-80% sun",,
246421,,,,"Celastrina ladon","Spring Azure",Iowa,Fremont,2003-04-22,,"Waubonsie State Park",40.676,-95.689,"Frank Olsen",adult,Sighting,Sighting,3,,,,,,,,,
266818,,,,"Satyrium caryaevorus","Hickory Hairstreak",Iowa,Fremont,2020-06-16,9:35:34,Redacted,Redacted,Redacted,"Paul Frese",adult,Sighting,Photograph,1,,,,,,,,,
274479,,,,"Strymon melinus","Gray Hairstreak",Iowa,Fremont,2020-08-21,,"Waubonsie State Park",40.676,-95.689,"Frank Olsen",adult,Sighting,Sighting,1,,,,,,,,,"1255-1500, sunny, 84-88, S 0-9"
274480,,,,"Cupido comyntas","Eastern-tailed Blue",Iowa,Fremont,2020-08-21,,"Waubonsie State Park",40.676,-95.689,"Frank Olsen",adult,Sighting,Sighting,10,,,,,,,,,"1255-1500, sunny, 84-88, S 0-9"
275170,,,,"Parrhasius m-album","White-M Hairstreak",Iowa,Fremont,2020-09-04,,"Waubonsie State Park",40.670911,-95.693287,"Jay Gilliam",adult,Sighting,Photograph,1,,,,,,,,,
275362,,,,"Cupido comyntas","Eastern-tailed Blue",Iowa,Fremont,2020-09-04,,"Waubonsie State Park",40.670911,-95.693287,"Jay Gilliam",adult,Sighting,Sighting,35,,,,,,,,,
281097,,,,"Cupido comyntas","Eastern-tailed Blue",Iowa,Fremont,2020-08-30,,"Waubonsie State Park",40.677029,-95.691183,"Chris Edwards",adult,Sighting,Sighting,10,,,,,,,,,
281116,,,,"Echinargus isola","Reakirt's Blue",Iowa,Fremont,2020-08-30,,"Waubonsie State Park",40.677029,-95.691183,"Chris Edwards",adult,Sighting,Sighting,1,,,,,,,,,
281467,,,,"Parrhasius m-album","White-M Hairstreak",Iowa,Fremont,2020-08-30,,"Waubonsie State Park",40.677029,-95.691183,"Chris Edwards",adult,Sighting,Sighting,1,,,,,,,,,
281967,,,,"Strymon melinus","Gray Hairstreak",Iowa,Fremont,2020-08-30,,"Waubonsie State Park",40.677029,-95.691183,"Chris Edwards",adult,Sighting,Sighting,3,,,,,,,,,
317405,,,,"Strymon melinus","Gray Hairstreak",Iowa,Fremont,2022-09-18,,"Waubonsie State Park",40.676,-95.689,"Frank Olsen",adult,,Sighting,1,,,,,,,,,"1020-1240, sunny, 73-84, SE 0-7"
346431,,,,"Cupido comyntas","Eastern-tailed Blue",Iowa,Fremont,2023-05-06,,"Waubonsie State Park",40.670911,-95.693287,"Jay Gilliam",adult,Sighting,Sighting,2,,,,,,,,,
346960,,,,"Cupido comyntas","Eastern-tailed Blue",Iowa,Fremont,2023-08-05,,"Riverton Wildlife Managemnet Area",40.706637,-95.576632,"Jay Gilliam",adult,Sighting,Sighting,2,,,,,,,,,
