ID,"Collection / Source","Catalog Number","Specify Number",Taxon,"Common Name",State,County,Date,Time,Locale,Latitude,Longitude,Collector,"Life Stage","Collection Method","Preparation Type",Count,Temperature,Humidity,"Dew Point",Wind,"Wind Direction","Barometric Pressure",Sky,"Moon Phase",Notes
3148,,2014-003429,,"Euphyes conspicua","Black Dash",Iowa,Franklin,1950-07-15,,"Franklin County",42.737236,-93.33889," USGS - NPWRC",adult,Sighting,Sighting,1,,,,,,,,,"HIstorical Record"
3177,,2014-003458,,"Euphyes dion","Dion Skipper",Iowa,Franklin,1950-07-15,,Redacted,Redacted,Redacted," USGS - NPWRC",adult,Sighting,Sighting,1,,,,,,,,,"HIstorical Record"
55304,,2014-055686,,"Euphyes conspicua","Black Dash",Iowa,Franklin,2006-07-10,,"Kothenbeutel Prairie",42.87817,-93.1365,"Frank Olsen",adult,Sighting,Sighting,2,,,,,,,,,
55305,,2014-055687,,"Euphyes conspicua","Black Dash",Iowa,Franklin,2006-07-18,,"Kothenbeutel Prairie",42.87817,-93.1365,"Frank Olsen",adult,Sighting,Sighting,2,,,,,,,,,
55420,,2014-055802,,"Euphyes vestris","Dun Skipper",Iowa,Franklin,2006-07-18,,"Kothenbeutel Prairie",42.87817,-93.1365,"Frank Olsen",adult,Sighting,Sighting,1,,,,,,,,,
107089,,2014-107836,,"Euphyes conspicua","Black Dash",Iowa,Franklin,2010-07-03,,"Franklin County",42.743428,-93.248793,"Mark Leoschke",adult,Sighting,Sighting,1,,,,,,,,,
107090,,2014-107837,,"Euphyes conspicua","Black Dash",Iowa,Franklin,2010-07-03,,"Longdpun Habitat Area - Lukes Wetland",42.755236,-93.27918,"Mark Leoschke",adult,Sighting,Sighting,1,,,,,,,,,
316729,,,,"Euphyes conspicua","Black Dash",Iowa,Franklin,2022-07-13,,"Kothenbeutel Prairie",42.87817,-93.1365,"Frank Olsen",adult,,Sighting,2,,,,,,,,,"1125-1145, sunny, 79-80, NW 1-4"
