ID,"Collection / Source","Catalog Number","Specify Number",Taxon,"Common Name",State,County,Date,Time,Locale,Latitude,Longitude,Collector,"Life Stage","Collection Method","Preparation Type",Count,Temperature,Humidity,"Dew Point",Wind,"Wind Direction","Barometric Pressure",Sky,"Moon Phase",Notes
158467,,2016-023212,,"Ischnura posita","Fragile Forktail",Iowa,Decatur,2000-06-22,,"Nine Eagles State Park",40.59723,-93.75245,"Bob Cruden",adult,Sighting,Sighting,1,,,,,,,,,lake
277060,,,,"Ischnura posita","Fragile Forktail",Iowa,Decatur,2020-06-04,,"Slip Bluff County Park",40.652884,-93.847544,"Jay Gilliam",adult,Sighting,Sighting,1,,,,,,,,,
277134,,,,"Ischnura posita","Fragile Forktail",Iowa,Decatur,2020-06-12,,"Slip Bluff County Park",40.652884,-93.847544,"Jay Gilliam",adult,Sighting,Sighting,1,,,,,,,,,
293685,"Odonate Central",,,"Ischnura posita","Fragile Forktail",Iowa,Decatur,2020-06-04,,"Slip Bluff County Park",40.65212,-93.84538,"Jay Gilliam",adult,Sighting,"Observed Only",1,,,,,,,,,
293878,"Odonate Central",,,"Ischnura posita","Fragile Forktail",Iowa,Decatur,2020-06-12,,"Slip Bluff County Park",40.65212,-93.84538,"Jay Gilliam",adult,Sighting,"Observed Only",1,,,,,,,,,
318850,,,,"Ischnura posita","Fragile Forktail",Iowa,Decatur,2022-05-28,,"Slip Bluff County Park",40.652884,-93.847544,"Jay Gilliam",adult,Sighting,Photograph,1,,,,,,,,,
345710,,,,"Ischnura posita","Fragile Forktail",Iowa,Decatur,2023-06-17,,"Slip Bluff County Park",40.652884,-93.847544,"Jay Gilliam",adult,Sighting,Sighting,2,,,,,,,,,
345935,,,,"Ischnura posita","Fragile Forktail",Iowa,Decatur,2023-07-08,,"Slip Bluff County Park",40.652884,-93.847544,"Jay Gilliam",adult,Sighting,Sighting,2,,,,,,,,,
346119,,,,"Ischnura posita","Fragile Forktail",Iowa,Decatur,2023-08-20,,"Slip Bluff County Park",40.652884,-93.847544,"Jay Gilliam",adult,Sighting,Sighting,10,,,,,,,,,
