ID,"Collection / Source","Catalog Number","Specify Number",Taxon,"Common Name",State,County,Date,Time,Locale,Latitude,Longitude,Collector,"Life Stage","Collection Method","Preparation Type",Count,Temperature,Humidity,"Dew Point",Wind,"Wind Direction","Barometric Pressure",Sky,"Moon Phase",Notes
2460,,2014-002741,,"Colias eurytheme","Orange Sulphur",Iowa,Boone,1950-08-01,,"Boone County",42.088177,-93.987846," USGS - NPWRC",adult,Sighting,Sighting,1,,,,,,,,,"HIstorical Record"
113354,,2015-003912,,"Colias eurytheme","Orange Sulphur",Iowa,Boone,2002-09-15,,"Ledges State Park",41.993622,-93.881838,"Chris Edwards",adult,Sighting,Sighting,3,,,,,,,,,
251362,,,,"Colias eurytheme","Orange Sulphur",Iowa,Boone,2018-06-25,10:00,"Onion Creek Area",42.051655,-93.70125,IBSN,adult,Sighting,Sighting,5,74,,,"Relatively Still",,,"Mostly Clear",,
251363,,,,"Colias eurytheme","Orange Sulphur",Iowa,Boone,2018-06-22,10:00,"Onion Creek Area",42.051655,-93.70125,IBSN,adult,Sighting,Sighting,2,70,,,"Relatively Still",,,"Partly Cloudy",,
251364,,,,"Colias eurytheme","Orange Sulphur",Iowa,Boone,2018-07-11,10:00,"Onion Creek Area",42.051655,-93.70125,IBSN,adult,Sighting,Sighting,1,80,,,"Relatively Still",,,"Mostly Clear",,
251365,,,,"Colias eurytheme","Orange Sulphur",Iowa,Boone,2018-07-15,10:00,"Onion Creek Area",42.051655,-93.70125,IBSN,adult,Sighting,Sighting,2,73,,,"Relatively Still",,,"Mostly Clear",,
251366,,,,"Colias eurytheme","Orange Sulphur",Iowa,Boone,2018-07-18,10:00,"Onion Creek Area",42.051655,-93.70125,IBSN,adult,Sighting,Sighting,3,78,,,"Relatively Still",,,Clear,,
251367,,,,"Colias eurytheme","Orange Sulphur",Iowa,Boone,2018-07-21,10:00,"Onion Creek Area",42.051655,-93.70125,IBSN,adult,Sighting,Sighting,12,76,,,"Moderately Windy",,,Clear,,
251368,,,,"Colias eurytheme","Orange Sulphur",Iowa,Boone,2018-07-25,10:00,"Onion Creek Area",42.051655,-93.70125,IBSN,adult,Sighting,Sighting,3,76,,,"Relatively Still",,,Clear,,
251369,,,,"Colias eurytheme","Orange Sulphur",Iowa,Boone,2018-08-01,10:00,"Onion Creek Area",42.051655,-93.70125,IBSN,adult,Sighting,Sighting,4,74,,,"Relatively Still",,,"Mostly Clear",,
251370,,,,"Colias eurytheme","Orange Sulphur",Iowa,Boone,2018-08-13,10:00,"Onion Creek Area",42.051655,-93.70125,IBSN,adult,Sighting,Sighting,15,78,,,"Relatively Still",,,"Mostly Clear",,
251371,,,,"Colias eurytheme","Orange Sulphur",Iowa,Boone,2018-08-17,10:00,"Onion Creek Area",42.051655,-93.70125,IBSN,adult,Sighting,Sighting,15,76,,,"Relatively Still",,,Clear,,
251372,,,,"Colias eurytheme","Orange Sulphur",Iowa,Boone,2018-08-08,10:00,"Onion Creek Area",42.051655,-93.70125,IBSN,adult,Sighting,Sighting,5,69,,,"Relatively Still",,,"Mostly Clear",,
251373,,,,"Colias eurytheme","Orange Sulphur",Iowa,Boone,2018-08-22,10:00,"Onion Creek Area",42.051655,-93.70125,IBSN,adult,Sighting,Sighting,53,74,,,"Relatively Still",,,"Mostly Clear",,
251374,,,,"Colias eurytheme","Orange Sulphur",Iowa,Boone,2018-08-27,10:00,"Onion Creek Area",42.051655,-93.70125,IBSN,adult,Sighting,Sighting,39,77,,,"Moderately Windy",,,"Mostly Clear",,
251375,,,,"Colias eurytheme","Orange Sulphur",Iowa,Boone,2018-08-29,10:00,"Onion Creek Area",42.051655,-93.70125,IBSN,adult,Sighting,Sighting,44,72,,,"Relatively Still",,,"Mostly Clear",,
251376,,,,"Colias eurytheme","Orange Sulphur",Iowa,Boone,2018-09-10,10:00,"Onion Creek Area",42.051655,-93.70125,IBSN,adult,Sighting,Sighting,18,78,,,"Relatively Still",,,"Mostly Clear",,
251377,,,,"Colias eurytheme","Orange Sulphur",Iowa,Boone,2018-09-12,10:00,"Onion Creek Area",42.051655,-93.70125,IBSN,adult,Sighting,Sighting,30,78,,,"Relatively Still",,,Clear,,
251378,,,,"Colias eurytheme","Orange Sulphur",Iowa,Boone,2018-09-17,10:00,"Onion Creek Area",42.051655,-93.70125,IBSN,adult,Sighting,Sighting,24,82,,,"Relatively Still",,,"Mostly Clear",,
251379,,,,"Colias eurytheme","Orange Sulphur",Iowa,Boone,2018-09-23,10:00,"Onion Creek Area",42.051655,-93.70125,IBSN,adult,Sighting,Sighting,5,69,,,Calm,,,Clear,,
326675,,,,"Colias eurytheme","Orange Sulphur",Iowa,Boone,2022-05-16,,"Swede Point Park",41.887058,-93.854351,IBSN,adult,Sighting,Sighting,1,76,,,"Relatively Still",,,"Mostly Clear",,
326676,,,,"Colias eurytheme","Orange Sulphur",Iowa,Boone,2022-06-02,,"Swede Point Park",41.887058,-93.854351,IBSN,adult,Sighting,Sighting,2,70,,,Calm,,,"Mostly Clear",,
326677,,,,"Colias eurytheme","Orange Sulphur",Iowa,Boone,2022-07-01,,"Swede Point Park",41.887058,-93.854351,IBSN,adult,Sighting,Sighting,1,85,,,"Relatively Still",,,"Mostly Clear",,
326678,,,,"Colias eurytheme","Orange Sulphur",Iowa,Boone,2022-07-19,,"Swede Point Park",41.887058,-93.854351,IBSN,adult,Sighting,Sighting,5,89,,,"Moderately Windy",,,"Mostly Clear",,
326679,,,,"Colias eurytheme","Orange Sulphur",Iowa,Boone,2022-07-28,,"Swede Point Park",41.887058,-93.854351,IBSN,adult,Sighting,Sighting,2,79,,,"Moderately Windy",,,"Partly Cloudy",,
