ID,"Collection / Source","Catalog Number","Specify Number",Taxon,"Common Name",State,County,Date,Time,Locale,Latitude,Longitude,Collector,"Life Stage","Collection Method","Preparation Type",Count,Temperature,Humidity,"Dew Point",Wind,"Wind Direction","Barometric Pressure",Sky,"Moon Phase",Notes
5627,,2014-005908,,"Satyrium calanus","Banded Hairstreak",Iowa,Allamakee,1950-07-01,,"Allamakee County",43.243076,-91.443466," USGS - NPWRC",adult,Sighting,Sighting,1,,,,,,,,,"HIstorical Record"
10003,,2014-010284,,"Satyrium calanus","Banded Hairstreak",Iowa,Allamakee,2012-07-07,,"Effigy Mounds National Monument",43.100641,-91.183746,"Tom Jantscher",adult,Sighting,Sighting,1,,,,,,,,,
10004,,2014-010285,,"Satyrium calanus","Banded Hairstreak",Iowa,Allamakee,2012-07-07,,"Effigy Mounds National Monument",43.100641,-91.183746,"Tom Jantscher",adult,Sighting,Sighting,1,,,,,,,,,
62143,,2014-062744,,"Satyrium calanus","Banded Hairstreak",Iowa,Allamakee,1987-06-13,,"Hanover Township",43.37643,-91.54023,"John G. Nehnevaj",adult,Sighting,Sighting,1,,,,,,,,,
62144,,2014-062745,,"Satyrium calanus","Banded Hairstreak",Iowa,Allamakee,1987-06-25,,"Hanover Township",43.37643,-91.54023,"John G. Nehnevaj",adult,Sighting,Sighting,1,,,,,,,,,
62153,,2014-062754,,"Satyrium calanus","Banded Hairstreak",Iowa,Allamakee,1987-06-13,,"Black Hawk Point Wildlife Management Area",43.45604,-91.30837,"John G. Nehnevaj",adult,Sighting,Sighting,1,,,,,,,,,
62154,,2014-062755,,"Satyrium calanus","Banded Hairstreak",Iowa,Allamakee,1987-06-30,,"Black Hawk Point Wildlife Management Area",43.45604,-91.30837,"John G. Nehnevaj",adult,Sighting,Sighting,1,,,,,,,,,
62155,,2014-062756,,"Satyrium calanus","Banded Hairstreak",Iowa,Allamakee,1987-06-27,,"Black Hawk Point Wildlife Management Area",43.45604,-91.30837,"John G. Nehnevaj",adult,Sighting,Sighting,1,,,,,,,,,
62162,,2014-062763,,"Satyrium calanus","Banded Hairstreak",Iowa,Allamakee,1987-06-18,,"Mount Hosmer Park",43.36597,-91.22188,"John G. Nehnevaj",adult,Sighting,Sighting,1,,,,,,,,,
62173,,2014-062774,,"Satyrium calanus","Banded Hairstreak",Iowa,Allamakee,1987-06-21,,"Clear Creek Fen",43.455306,-91.42388,"John G. Nehnevaj",adult,Sighting,Sighting,1,,,,,,,,,
62180,,2014-062781,,"Satyrium calanus","Banded Hairstreak",Iowa,Allamakee,2010-06-25,,"Yellow River State Forest",43.17253,-91.25173,"Frank Olsen",adult,Sighting,Sighting,10,,,,,,,,,
68318,,2014-068923,,"Satyrium calanus","Banded Hairstreak",Iowa,Allamakee,2014-07-13,,"Effigy Mounds National Monument",43.100641,-91.183746,"Tom Jantscher",adult,Sighting,Sighting,1,70,,,1,180,," 40% cloud cover",,
68319,,2014-068924,,"Satyrium calanus","Banded Hairstreak",Iowa,Allamakee,2014-07-13,,"Effigy Mounds National Monument",43.100641,-91.183746,"Tom Jantscher",adult,Sighting,Sighting,1,70,,,1,180,," 40% cloud cover",,
68361,,2014-068966,,"Satyrium calanus","Banded Hairstreak",Iowa,Allamakee,2014-07-13,,"Effigy Mounds National Monument",43.100641,-91.183746,"Tom Jantscher",adult,Sighting,Sighting,1,79,,,2,90,," 1% cloud cover",,
68408,,2014-069013,,"Satyrium calanus","Banded Hairstreak",Iowa,Allamakee,2014-07-13,,"Yellow River State Forest",43.16861111,-91.22,"Tom Jantscher",adult,Sighting,Sighting,1,80,,,2,,," partly cloudy",,
68409,,2014-069014,,"Satyrium calanus","Banded Hairstreak",Iowa,Allamakee,2014-07-13,,"Yellow River State Forest",43.16861111,-91.22,"Tom Jantscher",adult,Sighting,Sighting,1,80,,,2,,," partly cloudy",,
68410,,2014-069015,,"Satyrium calanus","Banded Hairstreak",Iowa,Allamakee,2014-07-13,,"Yellow River State Forest",43.16861111,-91.22,"Tom Jantscher",adult,Sighting,Sighting,1,80,,,2,,," partly cloudy",,
68432,,2014-069037,,"Satyrium calanus","Banded Hairstreak",Iowa,Allamakee,2014-07-13,,"Yellow River State Forest",43.20138889,-91.28444444,"Tom Jantscher",adult,Sighting,Sighting,1,75,,,2,,," partly cloudy",,
68433,,2014-069038,,"Satyrium calanus","Banded Hairstreak",Iowa,Allamakee,2014-07-13,,"Yellow River State Forest",43.20138889,-91.28444444,"Tom Jantscher",adult,Sighting,Sighting,1,75,,,2,,," partly cloudy",,
69087,,2014-069694,,"Satyrium calanus","Banded Hairstreak",Iowa,Allamakee,2009-06-20,,"Heritage Valley",43.37455,-91.589809,"Moni Hayne",adult,Sighting,Sighting,1,,,,,,,,,
110259,,2015-000815,,"Satyrium calanus","Banded Hairstreak",Iowa,Allamakee,2010-06-25,,"Yellow River State Forest",43.17253,-91.25173,"Jim Durbin",adult,Sighting,Photograph,1,,,,,,,,,
110261,,2015-000817,,"Satyrium calanus","Banded Hairstreak",Iowa,Allamakee,2010-06-25,,"Yellow River State Forest",43.17253,-91.25173,"Jim Durbin",adult,Sighting,Photograph,1,,,,,,,,,
119010,,2015-009568,,"Satyrium calanus","Banded Hairstreak",Iowa,Allamakee,2008-07-13,,"Effigy Mounds National Monument",43.100641,-91.183746,"Chris Edwards",adult,Sighting,Sighting,9,,,,,,,,,
119011,,2015-009569,,"Satyrium calanus","Banded Hairstreak",Iowa,Allamakee,2009-07-03,,"Effigy Mounds National Monument",43.100641,-91.183746,"Chris Edwards",adult,Sighting,Sighting,1,,,,,,,,,
119012,,2015-009570,,"Satyrium calanus","Banded Hairstreak",Iowa,Allamakee,2012-07-07,,"Effigy Mounds National Monument",43.100641,-91.183746,"Chris Edwards",adult,Sighting,Sighting,2,,,,,,,,,
119013,,2015-009571,,"Satyrium calanus","Banded Hairstreak",Iowa,Allamakee,2013-07-15,,"Effigy Mounds National Monument",43.100641,-91.183746,"Chris Edwards",adult,Sighting,Sighting,1,,,,,,,,,
119014,,2015-009572,,"Satyrium calanus","Banded Hairstreak",Iowa,Allamakee,2014-07-13,,"Effigy Mounds National Monument",43.100641,-91.183746,"Chris Edwards",adult,Sighting,Sighting,3,,,,,,,,,
119015,,2015-009573,,"Satyrium calanus","Banded Hairstreak",Iowa,Allamakee,2002-07-04,,"Yellow River State Forest",43.170603,-91.240395,"Chris Edwards",adult,Sighting,Sighting,9,,,,,,,,,
119016,,2015-009574,,"Satyrium calanus","Banded Hairstreak",Iowa,Allamakee,2003-07-12,,"Yellow River State Forest",43.170603,-91.240395,"Chris Edwards",adult,Sighting,Sighting,70,,,,,,,,,
119017,,2015-009575,,"Satyrium calanus","Banded Hairstreak",Iowa,Allamakee,2004-07-04,,"Yellow River State Forest",43.170603,-91.240395,"Chris Edwards",adult,Sighting,Sighting,30,,,,,,,,,
119018,,2015-009576,,"Satyrium calanus","Banded Hairstreak",Iowa,Allamakee,2005-07-23,,"Yellow River State Forest",43.170603,-91.240395,"Chris Edwards",adult,Sighting,Sighting,2,,,,,,,,,
119019,,2015-009577,,"Satyrium calanus","Banded Hairstreak",Iowa,Allamakee,2006-07-04,,"Yellow River State Forest",43.170603,-91.240395,"Chris Edwards",adult,Sighting,Sighting,2,,,,,,,,,
119020,,2015-009578,,"Satyrium calanus","Banded Hairstreak",Iowa,Allamakee,2008-07-13,,"Yellow River State Forest",43.170603,-91.240395,"Chris Edwards",adult,Sighting,Sighting,8,,,,,,,,,
119021,,2015-009579,,"Satyrium calanus","Banded Hairstreak",Iowa,Allamakee,2009-07-03,,"Yellow River State Forest",43.170603,-91.240395,"Chris Edwards",adult,Sighting,Sighting,4,,,,,,,,,
119022,,2015-009580,,"Satyrium calanus","Banded Hairstreak",Iowa,Allamakee,2011-07-17,,"Yellow River State Forest",43.170603,-91.240395,"Chris Edwards",adult,Sighting,Sighting,5,,,,,,,,,
119023,,2015-009581,,"Satyrium calanus","Banded Hairstreak",Iowa,Allamakee,2014-07-13,,"Yellow River State Forest",43.170603,-91.240395,"Chris Edwards",adult,Sighting,Sighting,5,,,,,,,,,
119024,,2015-009582,,"Satyrium calanus","Banded Hairstreak",Iowa,Allamakee,2014-07-13,,"Yellow River State Forest",43.170603,-91.240395,"Chris Edwards",adult,Sighting,Sighting,4,,,,,,,,,
119025,,2015-009583,,"Satyrium calanus","Banded Hairstreak",Iowa,Allamakee,2008-07-13,,"Big Prairie",43.268358,-91.370554,"Chris Edwards",adult,Sighting,Sighting,1,,,,,,,,,
130925,,2015-021516,,"Satyrium calanus","Banded Hairstreak",Iowa,Allamakee,2015-07-22,,"Armund Bartz Prairie",43.429728,-91.310705,"Frank Olsen",adult,Sighting,Sighting,2,80,,,2,180,,"30-55% sun",,
130944,,2015-021535,,"Satyrium calanus","Banded Hairstreak",Iowa,Allamakee,2015-07-21,,"Black Hawk Point Wildlife Management Area",43.4602778,-91.2980555,"Frank Olsen",adult,Sighting,Sighting,2,78,,,8,0,,"60-75% sun",,
131144,,2015-021735,,"Satyrium calanus","Banded Hairstreak",Iowa,Allamakee,2015-07-21,,"Whispering Pines Hill Prairie",43.427166,-91.287898,"Frank Olsen",adult,Sighting,Sighting,4,76,,,7,0,,"90-35% sun",,
174419,,2016-039169,,"Satyrium calanus","Banded Hairstreak",Iowa,Allamakee,2010-06-25,,"Yellow River State Forest",43.1777778,-91.265,"Jim Durbin",adult,Sighting,Photograph,1,,,,,,,,,
174420,,2016-039170,,"Satyrium calanus","Banded Hairstreak",Iowa,Allamakee,2010-06-25,,"Yellow River State Forest",43.1777778,-91.265,"Jim Durbin",adult,Sighting,Photograph,1,,,,,,,,,
183556,,2017-001517,,"Satyrium calanus","Banded Hairstreak",Iowa,Allamakee,2015-07-12,,"Effigy Mounds National Monument",43.100641,-91.183746,"Chris Edwards",adult,Sighting,Sighting,1,,,,,,,,,
183580,,2017-001541,,"Satyrium calanus","Banded Hairstreak",Iowa,Allamakee,2015-07-12,,"Yellow River State Forest",43.170603,-91.240395,"Chris Edwards",adult,Sighting,Sighting,14,,,,,,,,,
203138,,2018-001071,,"Satyrium calanus","Banded Hairstreak",Iowa,Allamakee,2017-07-08,,"Effigy Mounds National Monument",43.100641,-91.183746,"Chris Edwards",adult,Sighting,Sighting,2,,,,,,,,,
214105,,2018-012261,,"Satyrium calanus","Banded Hairstreak",Iowa,Allamakee,2018-06-24,,"Yellow River State Forest",43.175066,-91.237189,"Jim Durbin",adult,Sighting,Photograph,1,,,,,,,,,
225478,,2019-000414,,"Satyrium calanus","Banded Hairstreak",Iowa,Allamakee,2018-07-07,,"Yellow River State Forest",43.1738889,-91.2213889,"Mark Brown",adult,Sighting,Photograph,1,,,,,,,,,
227822,,2019-002544,,"Satyrium calanus","Banded Hairstreak",Iowa,Allamakee,2010-06-25,,"Yellow River State Forest",43.166015,-91.233583,"Jim Durbin",adult,Sighting,Photograph,1,,,,,,,,,
227823,,2019-002545,,"Satyrium calanus","Banded Hairstreak",Iowa,Allamakee,2010-06-25,,"Yellow River State Forest",43.166015,-91.233583,"Jim Durbin",adult,Sighting,Photograph,1,,,,,,,,,
227827,,2019-002549,,"Satyrium calanus","Banded Hairstreak",Iowa,Allamakee,2010-06-25,,"Yellow River State Forest",43.166015,-91.233583,"Jim Durbin",adult,Sighting,Photograph,1,,,,,,,,,
227828,,2019-002550,,"Satyrium calanus","Banded Hairstreak",Iowa,Allamakee,2010-06-25,,"Yellow River State Forest",43.166015,-91.233583,"Jim Durbin",adult,Sighting,Photograph,1,,,,,,,,,
227829,,2019-002551,,"Satyrium calanus","Banded Hairstreak",Iowa,Allamakee,2010-06-25,,"Yellow River State Forest",43.166015,-91.233583,"Jim Durbin",adult,Sighting,Photograph,1,,,,,,,,,
227833,,2019-002555,,"Satyrium calanus","Banded Hairstreak",Iowa,Allamakee,2010-06-25,,"Yellow River State Forest",43.166015,-91.233583,"Jim Durbin",adult,Sighting,Photograph,1,,,,,,,,,
228677,,2019-003399,,"Satyrium calanus","Banded Hairstreak",Iowa,Allamakee,2018-07-07,,"Effigy Mounds National Monument",43.100641,-91.183746,"Chris Edwards",adult,Sighting,Sighting,9,,,,,,,,,
228710,,2019-003432,,"Satyrium calanus","Banded Hairstreak",Iowa,Allamakee,2018-07-07,,"Yellow River State Forest",43.170603,-91.240395,"Chris Edwards",adult,Sighting,Sighting,3,,,,,,,,,
269428,,,,"Satyrium calanus","Banded Hairstreak",Iowa,Allamakee,2020-07-12,17:29:07,"Yellow River State Forest",43.17732634,-91.23410641,"Mark Brown",adult,Sighting,Photograph,1,,,,,,,,,
269431,,,,"Satyrium calanus","Banded Hairstreak",Iowa,Allamakee,2020-07-12,17:29:07,"Yellow River State Forest",43.17732634,-91.23410641,"Mark Brown",adult,Sighting,Photograph,1,,,,,,,,,
269499,,,,"Satyrium calanus","Banded Hairstreak",Iowa,Allamakee,2020-07-12,12:04:39,"Effigy Mounds National Monument",43.100641,-91.183746,"Mark Brown",adult,Sighting,Photograph,1,,,,,,,,,
269511,,,,"Satyrium calanus","Banded Hairstreak",Iowa,Allamakee,2020-07-12,12:04:39,"Effigy Mounds National Monument",43.100641,-91.183746,"Mark Brown",adult,Sighting,Photograph,1,,,,,,,,,
273290,,,,"Satyrium calanus","Banded Hairstreak",Iowa,Allamakee,2020-07-12,,"Effigy Mounds National Monument",43.100641,-91.183746,"Frank Olsen",adult,Sighting,Sighting,1,,,,,,,,,
274666,,,,"Satyrium calanus","Banded Hairstreak",Iowa,Allamakee,2020-06-25,,"Yellow River State Forest",43.176543,-91.249729,"Frank Olsen",adult,Sighting,Sighting,4,,,,,,,,,"1330-1510, mostly sunny, 77, 0-2"
274679,,,,"Satyrium calanus","Banded Hairstreak",Iowa,Allamakee,2020-07-12,,"Yellow River State Forest",43.176543,-91.249729,"Frank Olsen",adult,Sighting,Sighting,6,,,,,,,,,"1245-1630, mostly sunny, 77-79, N 0-4"
275160,,,,"Satyrium calanus","Banded Hairstreak",Iowa,Allamakee,2020-07-22,,"Clear Creek Fen",43.452358,-91.424706,"Jay Gilliam",adult,Sighting,Photograph,1,,,,,,,,,
279237,,,,"Satyrium calanus","Banded Hairstreak",Iowa,Allamakee,2020-07-03,,"Clear Creek Wildlife Management Area",43.456031,-91.417896,"Mark Brown",adult,Sighting,Photograph,1,,,,,,,,,
281887,,,,"Satyrium calanus","Banded Hairstreak",Iowa,Allamakee,2020-07-12,,"Effigy Mounds National Monument",43.100641,-91.183746,"Chris Edwards",adult,Sighting,Sighting,1,,,,,,,,,
281888,,,,"Satyrium calanus","Banded Hairstreak",Iowa,Allamakee,2020-07-12,,"Yellow River State Forest",43.170603,-91.240395,"Chris Edwards",adult,Sighting,Sighting,7,,,,,,,,,
295293,,,,"Satyrium calanus","Banded Hairstreak",Iowa,Allamakee,2021-07-17,10:58:10,"Effigy Mounds National Monument",43.08725518,-91.18881336,"Mark Brown",adult,Sighting,Photograph,1,,,,,,,,,
296893,,,,"Satyrium calanus","Banded Hairstreak",Iowa,Allamakee,2021-07-17,1150-1200,"Effigy Mounds National Monument",43.100641,-91.183746,"Frank Olsen",adult,Sighting,Sighting,1,69,,,,,," sunny",," NW 0-4"
296907,,,,"Satyrium calanus","Banded Hairstreak",Iowa,Allamakee,2021-07-17,1030-1045,"Yellow River State Forest",43.17253,-91.25173,"Frank Olsen",adult,Sighting,Sighting,2,57,,,,,," sunny",," N 8"
300669,,,,"Satyrium calanus","Banded Hairstreak",Iowa,Allamakee,2021-07-03,,"Clear Creek Fen",43.452358,-91.424706,"Jay Gilliam",adult,Sighting,Sighting,1,,,,,,,,,
308249,,,,"Satyrium calanus","Banded Hairstreak",Iowa,Allamakee,2021-07-17,,"Effigy Mounds National Monument",43.100641,-91.183746,"Chris Edwards",adult,Sighting,Sighting,4,,,,,,,,,
308285,,,,"Satyrium calanus","Banded Hairstreak",Iowa,Allamakee,2021-07-17,,"Yellow River State Forest",43.166015,-91.233583,"Chris Edwards",adult,Sighting,Sighting,4,,,,,,,,,
310967,,,,"Satyrium calanus","Banded Hairstreak",Iowa,Allamakee,2022-06-28,12:11:05,"Yellow River State Forest",43.17316581,-91.23742803,"Jim Durbin",adult,Sighting,Photograph,2,,,,,,,,,
311245,,,,"Satyrium calanus","Banded Hairstreak",Iowa,Allamakee,2022-06-28,12:10:39,"Yellow River State Forest",43.17316581,-91.23742803,"Jim Durbin",adult,Sighting,Photograph,1,,,,,,,,,
318173,,,,"Satyrium calanus","Banded Hairstreak",Iowa,Allamakee,2022-07-09,,"Effigy Mounds National Monument",43.101383,-91.187278,"Jay Gilliam",adult,Sighting,Sighting,1,,,,,,,,,"YRSF Count"
319668,,,,"Satyrium calanus","Banded Hairstreak",Iowa,Allamakee,2022-07-09,15:50,"Effigy Mounds National Monument",43.098179,-91.185951,"Jay Gilliam",adult,Sighting,Sighting,1,,,,,,,,,"Pammel State Park"
320087,,,,"Satyrium calanus","Banded Hairstreak",Iowa,Allamakee,2022-07-09,,"Effigy Mounds National Monument",43.098681,-91.188163,"Mark Brown",adult,Sighting,Photograph,1,,,,,,,,,
331395,,,,"Satyrium calanus","Banded Hairstreak",Iowa,Allamakee,2022-07-09,,"Effigy Mounds National Monument",43.100641,-91.183746,"Chris Edwards",adult,Sighting,Sighting,33,,,,,,,,,
331414,,,,"Satyrium calanus","Banded Hairstreak",Iowa,Allamakee,2022-07-09,,"Yellow River State Forest",43.18008,-91.282443,"Chris Edwards",adult,Sighting,Sighting,2,,,,,,,,,
331428,,,,"Satyrium calanus","Banded Hairstreak",Iowa,Allamakee,2022-07-09,,"Yellow River State Forest",43.166015,-91.233583,"Chris Edwards",adult,Sighting,Sighting,8,,,,,,,,,
349744,,,,"Satyrium calanus","Banded Hairstreak",Iowa,Allamakee,2023-07-15,,"Effigy Mounds National Monument",43.100641,-91.183746,"Chris Edwards",adult,Sighting,Sighting,2,,,,,,,,,
353539,,,,"Satyrium calanus","Banded Hairstreak",Iowa,Allamakee,1987-06-27,,"Black Hawk Point Wildlife Management Area",43.45949,-91.29776,"John G. Nehnevaj",adult,,,1,,,,,,,,,"Data from Kirk Larsen, Luther College"
353932,,,,"Satyrium calanus","Banded Hairstreak",Iowa,Allamakee,1987-06-30,,"Chimney Rock Prairie",43.4675,-91.325,"John G. Nehnevaj",adult,,,1,,,,,,,,,"Data from Kirk Larsen, Luther College"
355591,,,,"Satyrium calanus","Banded Hairstreak",Iowa,Allamakee,1987-06-13,,"Hanover Township",43.380615,-91.546052,"John G. Nehnevaj",adult,,,1,,,,,,,,,"Data from Kirk Larsen, Luther College"
355592,,,,"Satyrium calanus","Banded Hairstreak",Iowa,Allamakee,1987-06-13,,"Hanover Township",43.380615,-91.546052,"John G. Nehnevaj",adult,,,1,,,,,,,,,"Data from Kirk Larsen, Luther College"
357913,,,,"Satyrium calanus","Banded Hairstreak",Iowa,Allamakee,1987-06-18,,"Mount Hosmer Park",43.363887,-91.221697,"John G. Nehnevaj",adult,,,1,,,,,,,,,"Data from Kirk Larsen, Luther College"
358472,,,,"Satyrium calanus","Banded Hairstreak",Iowa,Allamakee,1987-06-25,,"Riverside Drive",43.427167,-91.52,"John G. Nehnevaj",adult,,,1,,,,,,,,,"Data from Kirk Larsen, Luther College"
358473,,,,"Satyrium calanus","Banded Hairstreak",Iowa,Allamakee,1987-06-25,,"Riverside Drive",43.427167,-91.52,"John G. Nehnevaj",adult,,,1,,,,,,,,,"Data from Kirk Larsen, Luther College"
358513,,,,"Satyrium calanus","Banded Hairstreak",Iowa,Allamakee,1987-06-13,,"Allamakee Sand Cove",43.436326,-91.30626,"John G. Nehnevaj",adult,,,1,,,,,,,,,"Data from Kirk Larsen, Luther College"
358904,,,,"Satyrium calanus","Banded Hairstreak",Iowa,Allamakee,1987-06-21,,"Union City Township: Large Hillside Prairie",43.462847,-91.433565,"John G. Nehnevaj",adult,,,1,,,,,,,,,"Data from Kirk Larsen, Luther College"
