ID,"Collection / Source","Catalog Number","Specify Number",Taxon,"Common Name",State,County,Date,Time,Locale,Latitude,Longitude,Collector,"Life Stage","Collection Method","Preparation Type",Count,Temperature,Humidity,"Dew Point",Wind,"Wind Direction","Barometric Pressure",Sky,"Moon Phase",Notes
44281,,2014-044658,SPM016697,"Psyche casta","Common Bagworm Moth",Iowa,Allamakee,2009-06-28,,"Heritage Valley",43.37455,-91.589809,"MJ Hatfield",adult,,Pinned,1,,,,,,,,,
44283,,2014-044660,SPM037196,"Psyche casta","Common Bagworm Moth",Iowa,Allamakee,2009-06-20,,"Heritage Valley",43.37455,-91.589809,"Moni Hayne",adult,Blacklight/Fluorescent,Photograph,1,,,,,,,,,
65755,,2014-066357,SPM037433,"Dahlica walshella",None,Iowa,Allamakee,2013-04-05,,"Black Hawk Point Wildlife Management Area",43.45639,-91.27917,"Kyle E. Johnson",adult,,Photograph,1,,,,,,,,,
65756,,2014-066358,SPM037433,"Psyche casta","Common Bagworm Moth",Iowa,Allamakee,2013-04-05,,"Black Hawk Point Wildlife Management Area",43.45639,-91.27917,"Kyle E. Johnson",adult,,Photograph,1,,,,,,,,,
69090,,2014-069697,,"Psyche casta","Common Bagworm Moth",Iowa,Allamakee,2009-06-19,,"Heritage Valley",43.37455,-91.589809,"Moni Hayne",adult,Blacklight/Fluorescent,Sighting,1,,,,,,,,,
144932,,2016-009553,,"Dahlica walshella",None,Iowa,Allamakee,2013-04-05,,"Black Hawk Point Wildlife Management Area",43.455555,-91.28,"Kyle E. Johnson",adult,,,1,43,,,,,," sunny/light wind",,"ridgeline dry-mesic Quercus-Carya-Ulmus woodland; Prunus, Tilia common, few Betula, Juniperus"
144933,,2016-009554,,"Dahlica walshella",None,Iowa,Allamakee,2013-04-05,,"Black Hawk Point Wildlife Management Area",43.455555,-91.28,"Kyle E. Johnson",adult,,,1,,,,,,,,,"yard/garage bordering dry-mesic Quercus-Carya-Ulmus forest hillside; Prunus, Tilia, Celtis common; near bluff prairie"
144934,,2016-009555,,"Psyche casta","Common Bagworm Moth",Iowa,Allamakee,2013-04-05,,"Black Hawk Point Wildlife Management Area",43.455555,-91.28,"Kyle E. Johnson",adult,,,1,,,,,,,,,"yard/garage bordering dry-mesic Quercus-Carya-Ulmus forest hillside; Prunus, Tilia, Celtis common; near bluff prairie"
144935,,2016-009556,,"Psyche casta","Common Bagworm Moth",Iowa,Allamakee,2013-04-05,,"Black Hawk Point Wildlife Management Area",43.455555,-91.28,"Kyle E. Johnson",adult,,,1,,,,,,,,,"yard/garage bordering dry-mesic Quercus-Carya-Ulmus forest hillside; Prunus, Tilia, Celtis common; near bluff prairie"
