ID,"Collection / Source","Catalog Number","Specify Number",Taxon,"Common Name",State,County,Date,Time,Locale,Latitude,Longitude,Collector,"Life Stage","Collection Method","Preparation Type",Count,Temperature,Humidity,"Dew Point",Wind,"Wind Direction","Barometric Pressure",Sky,"Moon Phase",Notes
17464,,2014-017764,SPM037310,"Baileya dormitans","Sleeping Baileya Moth",Iowa,Allamakee,2009-06-20,,"Heritage Valley",43.37455,-91.589809,"Moni Hayne",adult,Blacklight/Fluorescent,Photograph,1,,,,,,,,,
108368,,2014-109115,,"Baileya levitans","Pale Baileya",Iowa,Allamakee,2014-07-13,,"Black Hawk Point Wildlife Management Area",43.4555556,-91.28,"Tom Jantscher",adult,,Photograph,1,,,,,,,,,"Rich mature woods within steep bluffs overlooking Mississippi River valley"
145411,,2016-010032,,"Baileya dormitans","Sleeping Baileya Moth",Iowa,Allamakee,2015-06-21,,Redacted,Redacted,Redacted,"Kyle E. Johnson",adult,,,1,68,,,,,," mostly cloudy/calm/humid night",,"ridgeline dry-mesic Quercus-Carya deciduous woodland overlooking bluff prairie and river course"
145412,,2016-010033,,"Baileya dormitans","Sleeping Baileya Moth",Iowa,Allamakee,2015-06-21,,Redacted,Redacted,Redacted,"Kyle E. Johnson",adult,,,1,68,,,,,," mostly cloudy/calm/humid night",,"ridgeline dry-mesic Quercus-Carya deciduous woodland overlooking bluff prairie and river course"
145413,,2016-010034,,"Baileya levitans","Pale Baileya",Iowa,Allamakee,2015-05-06,,Redacted,Redacted,Redacted,"Kyle E. Johnson",adult,,,1,68,,,,,," mostly cloudy/light wind, showers prior",,"ridgeline dry-mesic Quercus-Carya deciduous woodland overlooking bluff prairie and river course"
145414,,2016-010035,,"Baileya australis","Small Baileya",Iowa,Allamakee,2015-05-06,,Redacted,Redacted,Redacted,"Kyle E. Johnson",adult,,,1,68,,,,,," mostly cloudy/light wind, showers prior",,"ridgeline dry-mesic Quercus-Carya deciduous woodland overlooking bluff prairie and river course"
145415,,2016-010036,,"Baileya australis","Small Baileya",Iowa,Allamakee,2015-06-21,,Redacted,Redacted,Redacted,"Kyle E. Johnson",adult,,,1,68,,,,,," mostly cloudy/calm/humid night",,"ridgeline dry-mesic Quercus-Carya deciduous woodland overlooking bluff prairie and river course"
145416,,2016-010037,,"Baileya australis","Small Baileya",Iowa,Allamakee,2015-06-21,,Redacted,Redacted,Redacted,"Kyle E. Johnson",adult,,,1,68,,,,,," mostly cloudy/calm/humid night",,"ridgeline dry-mesic Quercus-Carya deciduous woodland overlooking bluff prairie and river course"
145417,,2016-010038,,"Baileya australis","Small Baileya",Iowa,Allamakee,2015-06-21,,Redacted,Redacted,Redacted,"Kyle E. Johnson",adult,,,1,68,,,,,," mostly cloudy/calm/humid night",,"steep dry limestone hill prairie; below dry-mesic deciduous woodland, above river course"
145747,,2016-010373,,"Baileya australis","Small Baileya",Iowa,Allamakee,2015-05-06,,Redacted,Redacted,Redacted,"MJ Hatfield",adult,,Photograph,1,,,,,,,,,
145768,,2016-010395,,"Baileya dormitans","Sleeping Baileya Moth",Iowa,Allamakee,2015-05-06,,Redacted,Redacted,Redacted,"MJ Hatfield",adult,,Photograph,1,,,,,,,,,
145770,,2016-010397,,"Baileya australis","Small Baileya",Iowa,Allamakee,2015-05-06,,Redacted,Redacted,Redacted,"MJ Hatfield",adult,,Photograph,1,,,,,,,,,
145887,,2016-010514,,"Baileya australis","Small Baileya",Iowa,Allamakee,2015-06-21,,Redacted,Redacted,Redacted,"MJ Hatfield",adult,,Photograph,1,,,,,,,,,
184460,,2017-002421,,"Baileya dormitans","Sleeping Baileya Moth",Iowa,Allamakee,2016-08-13,,Redacted,Redacted,Redacted,"MJ Hatfield",adult,,Photograph,1,,,,,,,,,
