ID,"Collection / Source","Catalog Number","Specify Number",Taxon,"Common Name",State,County,Date,Time,Locale,Latitude,Longitude,Collector,"Life Stage","Collection Method","Preparation Type",Count,Temperature,Humidity,"Dew Point",Wind,"Wind Direction","Barometric Pressure",Sky,"Moon Phase",Notes
4548,,2014-004829,,"Papilio polyxenes","Black Swallowtail",Iowa,Allamakee,1950-08-01,,"Allamakee County",43.243076,-91.443466," USGS - NPWRC",adult,Sighting,Sighting,1,,,,,,,,,"HIstorical Record"
59348,,2014-059730,,"Papilio polyxenes","Black Swallowtail",Iowa,Allamakee,2006-05-02,,"Mount Hosmer Park",43.36597,-91.22188,"Frank Olsen",adult,Sighting,Sighting,2,,,,,,,,,
108721,,2014-059888,,"Papilio polyxenes","Black Swallowtail",Iowa,Allamakee,2006-05-02,,"Yellow River State Forest",43.17253,-91.25173,"Frank Olsen",adult,Sighting,Sighting,2,,,,,,,,,
108722,,2014-059889,,"Papilio polyxenes","Black Swallowtail",Iowa,Allamakee,2007-08-01,,"Yellow River State Forest",43.17253,-91.25173,"Frank Olsen",adult,Sighting,Sighting,1,,,,,,,,,
110073,,2015-000629,,"Papilio polyxenes","Black Swallowtail",Iowa,Allamakee,2014-05-30,9:40-11:05AM,"Yellow River State Forest",43.175005,-91.237128,"Frank Olsen",adult,Sighting,Sighting,1,68,,,3,0,,"100% Clear",,"* First site is Larkin?s Overlook (25 minutes); second site is a large clearing 50 yards west of Overlook Road and Larkin Hill Road (10 minutes); third site is Sawmill Overlook (15 minutes).  At first site, I found puccoon, abundant wild geraniums, violet wood sorrel, yellow star grass, and some kind of daisies; at second, abundant dandelions and campion; at the third, wild geraniums, puccoon, and a few columbine.  Saw a small garter snake at first site.  "
117081,,2015-007639,,"Papilio polyxenes","Black Swallowtail",Iowa,Allamakee,2010-07-17,,"Effigy Mounds National Monument",43.100641,-91.183746,"Chris Edwards",adult,Sighting,Sighting,3,,,,,,,,,
117082,,2015-007640,,"Papilio polyxenes","Black Swallowtail",Iowa,Allamakee,2001-06-23,,"Yellow River State Forest",43.170603,-91.240395,"Chris Edwards",adult,Sighting,Sighting,1,,,,,,,,,
117083,,2015-007641,,"Papilio polyxenes","Black Swallowtail",Iowa,Allamakee,2002-07-04,,"Yellow River State Forest",43.170603,-91.240395,"Chris Edwards",adult,Sighting,Sighting,3,,,,,,,,,
117084,,2015-007642,,"Papilio polyxenes","Black Swallowtail",Iowa,Allamakee,2003-07-12,,"Yellow River State Forest",43.170603,-91.240395,"Chris Edwards",adult,Sighting,Sighting,3,,,,,,,,,
117085,,2015-007643,,"Papilio polyxenes","Black Swallowtail",Iowa,Allamakee,2005-07-23,,"Yellow River State Forest",43.170603,-91.240395,"Chris Edwards",adult,Sighting,Sighting,7,,,,,,,,,
117086,,2015-007644,,"Papilio polyxenes","Black Swallowtail",Iowa,Allamakee,2006-07-04,,"Yellow River State Forest",43.170603,-91.240395,"Chris Edwards",adult,Sighting,Sighting,3,,,,,,,,,
117087,,2015-007645,,"Papilio polyxenes","Black Swallowtail",Iowa,Allamakee,2008-07-13,,"Yellow River State Forest",43.170603,-91.240395,"Chris Edwards",adult,Sighting,Sighting,2,,,,,,,,,
117088,,2015-007646,,"Papilio polyxenes","Black Swallowtail",Iowa,Allamakee,2011-07-17,,"Yellow River State Forest",43.170603,-91.240395,"Chris Edwards",adult,Sighting,Sighting,1,,,,,,,,,
117089,,2015-007647,,"Papilio polyxenes","Black Swallowtail",Iowa,Allamakee,2013-07-15,,"Yellow River State Forest",43.170603,-91.240395,"Chris Edwards",adult,Sighting,Sighting,3,,,,,,,,,
117090,,2015-007648,,"Papilio polyxenes","Black Swallowtail",Iowa,Allamakee,2001-05-17,,"Yellow River State Forest",43.170603,-91.240395,"Chris Edwards",adult,Sighting,Sighting,1,,,,,,,,,
117091,,2015-007649,,"Papilio polyxenes","Black Swallowtail",Iowa,Allamakee,2007-07-07,,"Big Prairie",43.268358,-91.370554,"Chris Edwards",adult,Sighting,Sighting,4,,,,,,,,,
117092,,2015-007650,,"Papilio polyxenes","Black Swallowtail",Iowa,Allamakee,2008-07-13,,"Big Prairie",43.268358,-91.370554,"Chris Edwards",adult,Sighting,Sighting,1,,,,,,,,,
117093,,2015-007651,,"Papilio polyxenes","Black Swallowtail",Iowa,Allamakee,2010-07-17,,"Big Prairie",43.268358,-91.370554,"Chris Edwards",adult,Sighting,Sighting,1,,,,,,,,,
117094,,2015-007652,,"Papilio polyxenes","Black Swallowtail",Iowa,Allamakee,2013-07-15,,"Big Prairie",43.268358,-91.370554,"Chris Edwards",adult,Sighting,Sighting,1,,,,,,,,,
130939,,2015-021530,,"Papilio polyxenes","Black Swallowtail",Iowa,Allamakee,2015-07-21,,"Black Hawk Point Wildlife Management Area",43.4602778,-91.2980555,"Frank Olsen",adult,Sighting,Sighting,1,78,,,8,0,,"60-75% sun",,
131443,,2015-022034,,"Papilio polyxenes","Black Swallowtail",Iowa,Allamakee,2015-07-10,,"Zoll's Mountain Hill Prairie",43.439626,-91.331165,"Frank Olsen",adult,Sighting,Sighting,1,81,,,5,180,,"50% clouds/haze",,
131449,,2015-022040,,"Papilio polyxenes","Black Swallowtail",Iowa,Allamakee,2015-07-22,,"Zoll's Mountain Hill Prairie",43.439626,-91.331165,"Frank Olsen",adult,Sighting,Sighting,1,80,,,4,180,,"40-50% sun",,
184036,,2017-001997,,"Papilio polyxenes","Black Swallowtail",Iowa,Allamakee,2016-07-25,,"Yellow River SF Count Circle",43.127208,-91.210916,"Chris Edwards",adult,Sighting,Sighting,1,,,,,,,,,
184046,,2017-002007,,"Papilio polyxenes","Black Swallowtail",Iowa,Allamakee,2016-07-25,,"Yellow River State Forest",43.170603,-91.240395,"Chris Edwards",adult,Sighting,Sighting,5,,,,,,,,,
184061,,2017-002022,,"Papilio polyxenes","Black Swallowtail",Iowa,Allamakee,2016-07-25,,"Yellow River State Forest",43.170603,-91.240395,"Chris Edwards",adult,Sighting,Sighting,2,,,,,,,,,
203007,,2018-001087,,"Papilio polyxenes","Black Swallowtail",Iowa,Allamakee,2017-07-08,,"Yellow River SF Count Circle",43.127208,-91.210916,"Chris Edwards",adult,Sighting,Sighting,2,,,,,,,,,
203008,,2018-001093,,"Papilio polyxenes","Black Swallowtail",Iowa,Allamakee,2017-07-08,,"Yellow River State Forest",43.170603,-91.240395,"Chris Edwards",adult,Sighting,Sighting,6,,,,,,,,,
203009,,2018-001112,,"Papilio polyxenes","Black Swallowtail",Iowa,Allamakee,2017-07-08,,"Yellow River State Forest",43.170603,-91.240395,"Chris Edwards",adult,Sighting,Sighting,1,,,,,,,,,
223952,,2018-022107,,"Papilio polyxenes","Black Swallowtail",Iowa,Allamakee,2018-08-18,,"Effigy Mounds National Monument",43.100641,-91.183746,"Frank Olsen",adult,Sighting,Sighting,1,,,,,,,,,"1230-1405, 67-80% sun, 78-81, N 0-3"
228675,,2019-003397,,"Papilio polyxenes","Black Swallowtail",Iowa,Allamakee,2018-07-07,,"Effigy Mounds National Monument",43.100641,-91.183746,"Chris Edwards",adult,Sighting,Sighting,1,,,,,,,,,
228705,,2019-003427,,"Papilio polyxenes","Black Swallowtail",Iowa,Allamakee,2018-07-07,,"Yellow River State Forest",43.170603,-91.240395,"Chris Edwards",adult,Sighting,Sighting,1,,,,,,,,,
248757,,,,"Papilio polyxenes","Black Swallowtail",Iowa,Allamakee,2019-07-07,,"Clear Creek Fen",43.452349,-91.42452,"Chris Edwards",adult,Sighting,Sighting,1,,,,,,,,,
248800,,,,"Papilio polyxenes","Black Swallowtail",Iowa,Allamakee,2019-07-13,,"Effigy Mounds National Monument",43.100641,-91.183746,"Chris Edwards",adult,Sighting,Sighting,2,,,,,,,,,
248813,,,,"Papilio polyxenes","Black Swallowtail",Iowa,Allamakee,2019-07-13,,"Yellow River SF Count Circle",43.127208,-91.210916,"Chris Edwards",adult,Sighting,Sighting,4,,,,,,,,,
258550,,,,"Papilio polyxenes","Black Swallowtail",Iowa,Allamakee,2019-08-29,13:35,"Waukon City Park ",43.256741,-91.475375,IBSN,adult,Sighting,Sighting,1,80,,,"Very Windy",,,"Partly Cloudy",,
274674,,,,"Papilio polyxenes","Black Swallowtail",Iowa,Allamakee,2020-07-12,,"Yellow River State Forest",43.176543,-91.249729,"Frank Olsen",adult,Sighting,Sighting,2,,,,,,,,,"1245-1630, mostly sunny, 77-79, N 0-4"
276059,,,,"Papilio polyxenes","Black Swallowtail",Iowa,Allamakee,2020-07-22,,"Clear Creek Fen",43.452358,-91.424706,"Jay Gilliam",adult,Sighting,Sighting,1,,,,,,,,,
281445,,,,"Papilio polyxenes","Black Swallowtail",Iowa,Allamakee,2020-07-12,,"Yellow River State Forest",43.170603,-91.240395,"Chris Edwards",adult,Sighting,Sighting,2,,,,,,,,,
281446,,,,"Papilio polyxenes","Black Swallowtail",Iowa,Allamakee,2020-07-12,,"Yellow River State Forest",43.170603,-91.240395,"Chris Edwards",adult,Sighting,Sighting,1,,,,,,,,,
285199,,,,"Papilio polyxenes","Black Swallowtail",Iowa,Allamakee,2020-08-29,,"Waukon City Park ",43.255905,-91.476124,IBSN,adult,Sighting,Sighting,1,70,,,"Moderately Windy",,,"Partly Cloudy",,
285210,,,,"Papilio polyxenes","Black Swallowtail",Iowa,Allamakee,2020-09-23,,"Waukon City Park ",43.255905,-91.476124,IBSN,adult,Sighting,Sighting,1,79,,,Calm,,,Clear,,
296874,,,,"Papilio polyxenes","Black Swallowtail",Iowa,Allamakee,2021-07-13,1425-1450,"Clear Creek Fen",43.455306,-91.42388,"Frank Olsen",adult,Sighting,Sighting,2,61,,,,,," partly sunny",," W 1-7"
296902,,,,"Papilio polyxenes","Black Swallowtail",Iowa,Allamakee,2021-07-17,1320-1425,"Yellow River State Forest",43.17253,-91.25173,"Frank Olsen",adult,Sighting,Sighting,4,60,,,,,," partly sunny",," N 1-10"
300664,,,,"Papilio polyxenes","Black Swallowtail",Iowa,Allamakee,2021-07-03,,"Clear Creek Fen",43.452358,-91.424706,"Jay Gilliam",adult,Sighting,Sighting,2,,,,,,,,,
308230,,,,"Papilio polyxenes","Black Swallowtail",Iowa,Allamakee,2021-07-17,,"Allamakee County",0,0,"Chris Edwards",adult,Sighting,Sighting,2,,,,,,,,,
308265,,,,"Papilio polyxenes","Black Swallowtail",Iowa,Allamakee,2021-07-17,,"Yellow River State Forest",43.18008,-91.282443,"Chris Edwards",adult,Sighting,Sighting,2,,,,,,,,,
308281,,,,"Papilio polyxenes","Black Swallowtail",Iowa,Allamakee,2021-07-17,,"Yellow River State Forest",43.166015,-91.233583,"Chris Edwards",adult,Sighting,Sighting,3,,,,,,,,,
350305,,,,"Papilio polyxenes","Black Swallowtail",Iowa,Allamakee,2023-07-15,,"Yellow River State Forest",43.18008,-91.282443,"Chris Edwards",adult,Sighting,Sighting,2,,,,,,,,,
354258,,,,"Papilio polyxenes","Black Swallowtail",Iowa,Allamakee,2013-07-10,,"Clear Creek Wildlife Management Area",43.449,-91.42,"Nicole Powers",adult,,,1,,,,,,,,,"Data from Kirk Larsen, Luther College"
358334,,,,"Papilio polyxenes","Black Swallowtail",Iowa,Allamakee,2010-07-12,,"Osterholm Site",43.482,-91.5216,"Kirk J. Larsen",adult,,,1,,,,,,,,,"Data from Kirk Larsen, Luther College"
358568,,,,"Papilio polyxenes","Black Swallowtail",Iowa,Allamakee,2013-08-13,,"Mile Long Prairie",43.406167,-91.550667,"Kirk J. Larsen",adult,,,1,,,,,,,,,"Data from Kirk Larsen, Luther College"
