ID,"Collection / Source","Catalog Number","Specify Number",Taxon,"Common Name",State,County,Date,Time,Locale,Latitude,Longitude,Collector,"Life Stage","Collection Method","Preparation Type",Count,Temperature,Humidity,"Dew Point",Wind,"Wind Direction","Barometric Pressure",Sky,"Moon Phase",Notes
29619,"Jim Durbin Drawer 051",2014-029972,SPM027672,"Hellinsia inquinatus",None,Iowa,Story,2012-05-28,,"Hickory Grove Park",41.99218,-93.36679,"Jim Durbin",adult,Blacklight/Fluorescent,Pinned,1,,,,,,,,,
29620,,2014-029973,SPM031618,"Hellinsia inquinatus",None,Kentucky,Daviess,2012-08-04,,"5031 Old Lyddane Bridge Road",37.746807,-87.185997,"Jim Durbin",adult,Blacklight/Fluorescent,Photograph,1,,,,,,,,,
29621,,2014-029974,SPM037504,"Hellinsia inquinatus",None,Iowa,Kossuth,2013-08-17,,Algona,43.06998,-94.23295,"Matt Kenne",adult,,Sighting,1,,,,,,,,,
130208,,2015-020798,,"Hellinsia inquinatus",None,Iowa,Ringgold,2015-05-27,,"Grand River Grasslands / Kellerton Bird Conservation Area",40.657259,-94.110879,"Logan Crees",adult,,Photograph,1,,,,,,,,,
133679,"Paul Martsching Collection",2015-024273,,"Hellinsia inquinatus",None,Iowa,Story,2005-08-29,,"Ames, Paul",42.02064,-93.623952,"Paul Martsching",adult,"Building Light",Pinned,1,,,,,,,,,
180083,"Paul Martsching Collection",2016-044833,,"Hellinsia inquinatus",None,Iowa,Story,2016-09-21,,"Ames, Paul",42.02064,-93.623952,"Paul Martsching",adult,"Building Light",Pinned,1,,,,,,,,,
192035,,2017-009996,,"Hellinsia inquinatus",None,Iowa,Linn,2017-05-31,2030-2300,"Hitaga Sand Ridge Prairie Preserve",42.250957,-91.632098,"Jim Durbin",adult,Blacklight/Fluorescent,Photograph,1,65,43,42,5,0,29.98,clear,"40% visible",
192082,,2017-010043,,"Hellinsia inquinatus",None,Iowa,Linn,2017-05-31,2030-2300,"Hitaga Sand Ridge Prairie Preserve",42.250957,-91.632098,"Jim Durbin",adult,Blacklight/Fluorescent,Photograph,1,65,43,42,5,0,29.98,clear,"40% visible",
193786,,2017-011777,,"Hellinsia inquinatus",None,Iowa,Linn,2014-07-13,2045-2330,"Hitaga Sand Ridge Prairie Preserve",42.250957,-91.632098,"Jim Durbin",adult,Blacklight/Fluorescent,Photograph,1,74,67,63,3,300,,"partly cloudy",,
200658,"Paul Martsching Collection",2017-018590,,"Hellinsia inquinatus",None,Iowa,Story,2017-10-20,,"Ames, Paul",42.02064,-93.623952,"Paul Martsching",adult,"Building Light",Pinned,1,,,,,,,,,
265509,,,,"Hellinsia inquinatus",None,Iowa,Linn,2020-06-05,22:21:10,"Hitaga Sand Ridge Prairie Preserve",42.25088607,-91.63212362,"Jim Durbin",adult,Blacklight/Fluorescent,Photograph,1,75,58,59,4,355,29.95,clear,Full,
269712,,,,"Hellinsia inquinatus",None,Iowa,Linn,2020-08-08,22:50:14,"Hitaga Sand Ridge Prairie Preserve",42.25088607,-91.63213435,"Jim Durbin",adult,Blacklight/Fluorescent,Photograph,1,78,81,71,7,180,30.02,clear,"80% visible",
269808,,,,"Hellinsia inquinatus",None,Iowa,Linn,2020-08-08,22:20:41,"Hitaga Sand Ridge Prairie Preserve",42.25088607,-91.63213435,"Jim Durbin",adult,Blacklight/Fluorescent,Photograph,1,78,81,71,7,180,30.02,clear,"80% visible",
270575,,,,"Hellinsia inquinatus",None,Iowa,Linn,2020-07-20,21:37:01,"Hitaga Sand Ridge Prairie Preserve",42.25088607,-91.63206998,"Jim Durbin",adult,Blacklight/Fluorescent,Photograph,1,71,75,63,3,110,29.61,clear,new,
270576,,,,"Hellinsia inquinatus",None,Iowa,Linn,2020-07-20,21:32:24,"Hitaga Sand Ridge Prairie Preserve",42.25088607,-91.63206998,"Jim Durbin",adult,Blacklight/Fluorescent,Photograph,1,71,75,63,3,110,29.61,clear,new,
308965,"Jim Durbin Drawer 051",2022-000237,,"Hellinsia inquinatus",None,Iowa,Allamakee,2007-10-20,,"Yellow River State Forest",43.168086,-91.242198,"Frank Olsen",adult,Blacklighting,Pinned,1,,,,,,,,,
332005,,,,"Hellinsia inquinatus",None,Iowa,Polk,2022-09-02,,"Trestle Trail, Thai Village, Des Moines",41.634951,-93.651871,"Mark Brown",adult,Sighting,Photograph,1,,,,,,,,,
358683,,,,"Hellinsia inquinatus",None,Iowa,Winneshiek,2018-09-13,,"Roslien Woods",43.3244,-91.8216,"Lena Schmitt",adult,,,1,,,,,,,,,"Data from Kirk Larsen, Luther College"
