ID,"Collection / Source","Catalog Number","Specify Number",Taxon,"Common Name",State,County,Date,Time,Locale,Latitude,Longitude,Collector,"Life Stage","Collection Method","Preparation Type",Count,Temperature,Humidity,"Dew Point",Wind,"Wind Direction","Barometric Pressure",Sky,"Moon Phase",Notes
201,,2014-000201,SPM010545,"Cissusa spadix","Black-dotted Brown Moth",Iowa,Linn,2007-03-26,,"J. Harold Ennis County Park",41.898488,-91.483092,"Frank Olsen",adult,,Pinned,1,,,,,,,,,"to verify"
21126,"Frank Olsen Drawer 59",2014-021463,SPM002639,"Cissusa spadix","Black-dotted Brown Moth",Iowa,Linn,2003-04-23,,"Wanatee County Park",42.00994,-91.57749,"Frank Olsen",adult,,Pinned,1,,,,,,,,,"Located at Iowa State"
21127,"Frank Olsen Drawer 59",2014-021464,SPM012794,"Cissusa spadix","Black-dotted Brown Moth",Iowa,Linn,2008-04-16,,"J. Harold Ennis County Park",41.898488,-91.483092,"Frank Olsen",adult,,Pinned,1,,,,,,,,,"Located at Iowa State"
21128,"Frank Olsen Drawer 59",2014-021465,SPM024580,"Cissusa spadix","Black-dotted Brown Moth",Iowa,Linn,2011-04-10,,"Pleasant Creek State Recreation Area, Linn County",42.11952,-91.81215,"Frank Olsen",adult,,Pinned,1,,,,,,,,,"Located at Iowa State"
21129,,2014-021466,SPM032228,"Cissusa spadix","Black-dotted Brown Moth",Iowa,Johnson,2012-03-27,,"Iowa City",41.667,-91.545,"Mark Brown",adult,,Photograph,1,,,,,,,,,
21130,,2014-021467,SPM038887,"Cissusa spadix","Black-dotted Brown Moth",Iowa,Guthrie,2011-05-07,,"Whiterock Conservancy",41.80725,-94.64085,"Leland Searles",adult,,Photograph,1,,,,,,,,,
65026,,2014-065627,,"Cissusa spadix","Black-dotted Brown Moth",Iowa,Kossuth,2014-05-08,,"Smith Wildlife Area",43.0245,-94.2107,"Matt Kenne",adult,,Sighting,1,,,,,,,,,
65621,,2014-066223,,"Cissusa spadix","Black-dotted Brown Moth",Iowa,Kossuth,2014-05-08,,"Smith Wildlife Area",43.0245,-94.2107,"Matt Kenne",adult,,Sighting,1,,,,,,,,,
108168,,2014-108915,,"Cissusa spadix","Black-dotted Brown Moth",Iowa,Lee,2014-05-03,,"Redwing Access to Buena Vista Mound Cemetery",40.3880556,-91.4444444,"Tom Jantscher",adult,,Photograph,1,67,,,3,,," few clouds",,"Small grassy cemetery in light woods on small Des Moines River bluff"
132104,"Paul Martsching Collection",2015-022695,,"Cissusa spadix","Black-dotted Brown Moth",Iowa,Story,2015-04-25,,"Ames, Paul",42.02064,-93.623952,"Paul Martsching",adult,"Building Light",Pinned,1,,,,,,,,,
132526,"Paul Martsching Collection",2015-023120,,"Cissusa spadix","Black-dotted Brown Moth",Iowa,Story,2015-04-25,,"Ames, Paul",42.02064,-93.623952,"Paul Martsching",adult,"Building Light",Pinned,1,,,,,,,,,
135917,,2016-000459,,"Cissusa spadix","Black-dotted Brown Moth",Iowa,Story,2012-03-30,,"Ames, Paul",42.02064,-93.623952,"Paul Martsching",adult,"Building Light",Photograph,1,,,,,,,,,
145395,,2016-010016,,"Cissusa spadix","Black-dotted Brown Moth",Iowa,Allamakee,2015-05-06,,Redacted,Redacted,Redacted,"Kyle E. Johnson",adult,,,1,68,,,,,," mostly cloudy/light wind, showers prior",,"ridgeline dry-mesic Quercus-Carya deciduous woodland overlooking bluff prairie and river course"
145396,,2016-010017,,"Cissusa spadix","Black-dotted Brown Moth",Iowa,Allamakee,2015-05-06,,Redacted,Redacted,Redacted,"Kyle E. Johnson",adult,,,1,68,,,,,," mostly cloudy/light wind, showers prior",,"ridgeline dry-mesic Quercus-Carya deciduous woodland overlooking bluff prairie and river course"
145615,,2016-010236,,"Cissusa spadix","Black-dotted Brown Moth",Iowa,Cedar,2012-03-22,,"Rest Area Interstate 80",41.64248,-91.05437,"Kyle E. Johnson",adult,,,1,64,,,,,," cloudy/mostly calm night, scattered showers",,"rest area facing gently hilly mesic to dry-mesic Quercus forest; Carya, Celtis, Ulmus common; sparse Acer, Fraxinus"
145616,,2016-010237,,"Cissusa spadix","Black-dotted Brown Moth",Iowa,Cedar,2012-03-22,,"Rest Area Interstate 80",41.64248,-91.05437,"Kyle E. Johnson",adult,,,1,64,,,,,," cloudy/mostly calm night, scattered showers",,"rest area facing gently hilly mesic to dry-mesic Quercus forest; Carya, Celtis, Ulmus common; sparse Acer, Fraxinus"
145631,,2016-010252,,"Cissusa spadix","Black-dotted Brown Moth",Iowa,Scott,2012-03-22,,"I-80 Rest Stop, West Bound, Davenport",41.59779,-90.47873,"Kyle E. Johnson",adult,,,1,64,,,,,," cloudy/mostly calm night, scattered showers",,"rest area facing small mesic deciduous woodland fragment along fencerow; surrounded by agricultural landscape"
175823,"Paul Martsching Collection",2016-040573,,"Cissusa spadix","Black-dotted Brown Moth",Iowa,Story,2016-04-18,,"Ames, Paul",42.02064,-93.623952,"Paul Martsching",adult,"Building Light",Pinned,1,,,,,,,,,
175824,"Paul Martsching Collection",2016-040574,,"Cissusa spadix","Black-dotted Brown Moth",Iowa,Story,2016-04-18,,"Ames, Paul",42.02064,-93.623952,"Paul Martsching",adult,"Building Light",Pinned,1,,,,,,,,,
175825,"Paul Martsching Collection",2016-040575,,"Cissusa spadix","Black-dotted Brown Moth",Iowa,Story,2016-04-18,,"Ames, Paul",42.02064,-93.623952,"Paul Martsching",adult,"Building Light",Pinned,1,,,,,,,,,
175826,"Paul Martsching Collection",2016-040576,,"Cissusa spadix","Black-dotted Brown Moth",Iowa,Story,2016-04-24,,"Ames, Paul",42.02064,-93.623952,"Paul Martsching",adult,"Building Light",Pinned,1,,,,,,,,,
175827,"Paul Martsching Collection",2016-040577,,"Cissusa spadix","Black-dotted Brown Moth",Iowa,Story,2016-04-24,,"Ames, Paul",42.02064,-93.623952,"Paul Martsching",adult,"Building Light",Pinned,1,,,,,,,,,
175828,"Paul Martsching Collection",2016-040578,,"Cissusa spadix","Black-dotted Brown Moth",Iowa,Story,2016-04-24,,"Ames, Paul",42.02064,-93.623952,"Paul Martsching",adult,"Building Light",Pinned,1,,,,,,,,,
198033,,2017-015967,,"Cissusa spadix","Black-dotted Brown Moth",Iowa,Story,2017-04-18,,"Ames, Paul",42.02064,-93.623952,"Paul Martsching",adult,"Building Light",Photograph,2,,,,,,,,,
198928,"Paul Martsching Collection",2017-016862,,"Cissusa spadix","Black-dotted Brown Moth",Iowa,Story,2017-04-18,,"Ames, Paul",42.02064,-93.62395,"Paul Martsching",adult,"Building Light",Pinned,1,,,,,,,,,
205326,,2018-003474,,"Cissusa spadix","Black-dotted Brown Moth",Iowa,Story,2012-03-30,,"Ames, Paul",42.02064,-93.623952,"Paul Martsching",adult,"Building Light",Sighting,1,,,,,,,,,
272616,"Paul Martsching Collection",2020-000197,,"Cissusa spadix","Black-dotted Brown Moth",Iowa,Story,2020-06-07,,"Ames, Paul",42.016779,-93.616948,"Paul Martsching",adult,"Building Light",Pinned,1,,,,,,,,,
272793,"Paul Martsching Collection",2020-000369,,"Cissusa spadix","Black-dotted Brown Moth",Iowa,Story,2020-09-22,,"Ames, Paul",42.016779,-93.616948,"Paul Martsching",adult,"Building Light",Pinned,1,,,,,,,,,
277995,,,,"Cissusa spadix","Black-dotted Brown Moth",Iowa,Guthrie,2011-05-07,,"Whiterock Conservancy",41.82054,-94.647763,"Leland Searles",adult,Sighting,Photograph,1,,,,,,,,,
287518,,,,"Cissusa spadix","Black-dotted Brown Moth",Iowa,Story,2021-04-06,,"Ames, Paul",42.01109,-93.61432,"Paul Martsching",adult,"Building Light",Sighting,1,60,,,6,145,,"partly cloudy",,
287529,,,,"Cissusa spadix","Black-dotted Brown Moth",Iowa,Story,2021-04-07,,"Ames, Paul",42.01109,-93.61432,"Paul Martsching",adult,"Building Light",Sighting,1,75,,,15,180,,"partly cloudy",,
287537,,,,"Cissusa spadix","Black-dotted Brown Moth",Iowa,Story,2021-04-08,,"Ames, Paul",42.01109,-93.61432,"Paul Martsching",adult,"Building Light",Sighting,3,53,,,13,180,,overcast,,
309023,"Jim Durbin Drawer 121",2022-000290,,"Cissusa spadix","Black-dotted Brown Moth",Iowa,Linn,2011-04-30,,"J. Harold Ennis County Park",41.89839,-91.482866,"Frank Olsen",adult,Blacklighting,Pinned,1,,,,,,,,,
341948,,,,"Cissusa spadix","Black-dotted Brown Moth",Iowa,Johnson,2023-04-13,,Redacted,Redacted,Redacted,"Mark Brown",adult,Sighting,Photograph,1,,,,,,,,,
