ID,"Collection / Source","Catalog Number","Specify Number",Taxon,"Common Name",State,County,Date,Time,Locale,Latitude,Longitude,Collector,"Life Stage","Collection Method","Preparation Type",Count,Temperature,Humidity,"Dew Point",Wind,"Wind Direction","Barometric Pressure",Sky,"Moon Phase",Notes
12865,,2014-013147,SPM003538,"Acrobasis indigenella","Leaf Crumpler Moth",Iowa,Jasper,2003-05-15,,"Neal Smith National Wildlife Refuge",41.5678,-93.2675,"Keith Summerville",adult,,Pinned,1,,,,,,,,,
24010,,2014-024356,SPM030855,"Acrobasis indigenella","Leaf Crumpler Moth",Iowa,Linn,2012-07-22,,"Wakpicada Natural Area",42.18892,-91.52035,"Jim Durbin",adult,Blacklight/Fluorescent,Photograph,1,,,,,,,,,
24011,,2014-024357,SPM030899,"Acrobasis indigenella","Leaf Crumpler Moth",Iowa,Linn,2012-07-22,,"Wakpicada Natural Area",42.18892,-91.52035,"Jim Durbin",adult,Blacklight/Fluorescent,Photograph,1,,,,,,,,,
24012,,2014-024358,SPM030916,"Acrobasis indigenella","Leaf Crumpler Moth",Iowa,Linn,2012-07-22,,"Wakpicada Natural Area",42.18892,-91.52035,"Jim Durbin",adult,Blacklight/Fluorescent,Photograph,1,,,,,,,,,
110975,,2015-001531,,"Acrobasis indigenella","Leaf Crumpler Moth",Iowa,Polk,2013-08-05,,Redacted,Redacted,Redacted,"Aaron Brees",adult,,Sighting,1,,,,,,,,,
207861,,2018-006026,,"Acrobasis indigenella","Leaf Crumpler Moth",Iowa,Story,2005-07-16,,"McFarland Park",42.092878,-93.571,"Paul Martsching",adult,"Building Light",Sighting,1,,,,,,,,,
312338,,,,"Acrobasis indigenella","Leaf Crumpler Moth",Iowa,Johnson,2022-07-23,22:14:16,"F. W. Kent Park",41.73491869,-91.72188289,"Jim Durbin",adult,Blacklight/Fluorescent,Photograph,1,88,65,74,12,190,29.81,cloudy,"40 % visible",
338429,,,,"Acrobasis indigenella","Leaf Crumpler Moth",Iowa,Johnson,2023-07-22,21:23:34,"F. W. Kent Park",41.73493888,-91.7219024,"Jim Durbin",adult,Blacklight/Fluorescent,Photograph,1,76,70,65,0,0,29.89,"partly cloudy","10% moon",
338452,,,,"Acrobasis indigenella","Leaf Crumpler Moth",Iowa,Johnson,2023-07-22,21:31:44,"F. W. Kent Park",41.73493888,-91.7219024,"Jim Durbin",adult,Blacklight/Fluorescent,Photograph,1,76,70,65,0,0,29.89,"partly cloudy","10% moon",
