ID,"Collection / Source","Catalog Number","Specify Number",Taxon,"Common Name",State,County,Date,Time,Locale,Latitude,Longitude,Collector,"Life Stage","Collection Method","Preparation Type",Count,Temperature,Humidity,"Dew Point",Wind,"Wind Direction","Barometric Pressure",Sky,"Moon Phase",Notes
937,"Jim Durbin Drawer 134",2014-000937,SPM001092,"Catocala amica-lineella","Girlfriend Underwing",Iowa,"Van Buren",2004-09-11,,"Shimek State Forest, Farmington Unit",40.64802,-91.7254,"Jim Durbin",adult,Blacklight/Fluorescent,Pinned,1,,,,,,,,,
18874,"Frank Olsen Drawer 38",2014-019197,SPM001975,"Catocala amica-lineella","Girlfriend Underwing",Iowa,"Van Buren",2004-09-11,,"Shimek State Forest, Farmington Unit",40.64802,-91.7254,"Frank Olsen",adult,,Pinned,1,,,,,,,,,"Located at Iowa State"
18875,"Frank Olsen Drawer 38",2014-019198,SPM001976,"Catocala amica-lineella","Girlfriend Underwing",Iowa,"Van Buren",2004-08-22,,"Shimek State Forest, Farmington Unit",40.64802,-91.7254,"Frank Olsen",adult,,Pinned,1,,,,,,,,,"Located at Iowa State"
18894,"Frank Olsen Drawer 38",2014-019217,SPM024373,"Catocala amica-lineella","Girlfriend Underwing",Iowa,"Van Buren",2011-07-20,,"Shimek State Forest, Farmington Unit",40.6659,-91.73637,"Frank Olsen",adult,,Pinned,1,,,,,,,,,"Located at Iowa State"
19284,"Jim Durbin Drawer 134",2014-019609,SPM035507,"Catocala amica-lineella","Girlfriend Underwing",Iowa,"Van Buren",2013-08-07,,"Shimek State Forest, Farmington Unit",40.6659,-91.73637,"Jim Durbin",adult,Blacklight/Fluorescent,Pinned,1,,,,,,,,,
19285,"Jim Durbin Drawer 134",2014-019610,SPM035508,"Catocala amica-lineella","Girlfriend Underwing",Iowa,"Van Buren",2013-08-07,,"Shimek State Forest, Farmington Unit",40.6659,-91.73637,"Jim Durbin",adult,Blacklight/Fluorescent,Pinned,1,,,,,,,,,
19286,"Jim Durbin Drawer 134",2014-019611,SPM035509,"Catocala amica-lineella","Girlfriend Underwing",Iowa,"Van Buren",2013-08-07,,"Shimek State Forest, Farmington Unit",40.6659,-91.73637,"Jim Durbin",adult,Blacklight/Fluorescent,Pinned,1,,,,,,,,,
19287,,2014-019612,SPM035676,"Catocala amica-lineella","Girlfriend Underwing",Iowa,"Van Buren",2013-08-07,,"Shimek State Forest, Farmington Unit",40.6659,-91.73637,"Jim Durbin",adult,Blacklight/Fluorescent,Photograph,1,,,,,,,,,
