ID,"Collection / Source","Catalog Number","Specify Number",Taxon,"Common Name",State,County,Date,Time,Locale,Latitude,Longitude,Collector,"Life Stage","Collection Method","Preparation Type",Count,Temperature,Humidity,"Dew Point",Wind,"Wind Direction","Barometric Pressure",Sky,"Moon Phase",Notes
132311,"Paul Martsching Collection",2015-022902,,"Dargida rubripennis","The Pink-streak",Iowa,Story,2015-08-07,,"Ames, Paul",42.02064,-93.623952,"Paul Martsching",adult,"Building Light",Pinned,1,,,,,,,,,
136773,,2016-001315,,"Dargida rubripennis","The Pink-streak",Iowa,Story,2006-08-03,,"Ames, Paul",42.02064,-93.623952,"Paul Martsching",adult,"Building Light",Photograph,1,,,,,,,,,
136774,,2016-001316,,"Dargida rubripennis","The Pink-streak",Iowa,Story,2006-08-04,,"Ames, Paul",42.02064,-93.623952,"Paul Martsching",adult,"Building Light",Photograph,1,,,,,,,,,
136775,,2016-001317,,"Dargida rubripennis","The Pink-streak",Iowa,Story,2006-08-12,,"Ames, Paul",42.02064,-93.623952,"Paul Martsching",adult,"Building Light",Photograph,1,,,,,,,,,
198444,"Paul Martsching Collection",2017-016378,,"Dargida rubripennis","The Pink-streak",Iowa,Story,2017-08-26,,"Ames, Paul",42.02064,-93.623952,"Paul Martsching",adult,"Building Light",Pinned,1,,,,,,,,,
207097,,2018-005262,,"Dargida rubripennis","The Pink-streak",Iowa,Story,2006-07-31,,"Ames, Paul",42.02064,-93.623952,"Paul Martsching",adult,"Building Light",Sighting,1,,,,,,,,,
207098,,2018-005263,,"Dargida rubripennis","The Pink-streak",Iowa,Story,2006-08-12,,"Ames, Paul",42.02064,-93.623952,"Paul Martsching",adult,"Building Light",Sighting,4,,,,,,,,,
207099,,2018-005264,,"Dargida rubripennis","The Pink-streak",Iowa,Story,2011-08-28,,"Ames, Paul",42.02064,-93.623952,"Paul Martsching",adult,"Building Light",Sighting,1,,,,,,,,,
207100,,2018-005265,,"Dargida rubripennis","The Pink-streak",Iowa,Story,2014-08-24,,"Ames, Paul",42.02064,-93.623952,"Paul Martsching",adult,"Building Light",Sighting,2,,,,,,,,,
239008,"Paul Martsching Collection",2019-008992,,"Dargida rubripennis","The Pink-streak",Iowa,Story,2019-08-23,3:30,"Ames, Paul",42.02064,-93.623952,"Paul Martsching",adult,"Building Light",Pinned,1,,,,,,,,,
239009,"Paul Martsching Collection",2019-008993,,"Dargida rubripennis","The Pink-streak",Iowa,Story,2019-08-10,3:30,"Ames, Paul",42.02064,-93.623952,"Paul Martsching",adult,"Building Light",Pinned,1,,,,,,,,,
239010,"Paul Martsching Collection",2019-008994,,"Dargida rubripennis","The Pink-streak",Iowa,Story,2019-08-01,3:30,"Ames, Paul",42.02064,-93.623952,"Paul Martsching",adult,"Building Light",Pinned,1,,,,,,,,,
244523,,,,"Dargida rubripennis","The Pink-streak",Iowa,Story,2019-08-05,3:30,"Ames, Paul",42.02064,-93.623952,"Paul Martsching",adult,"Building Light",Sighting,1,,,,,,,,,
244524,,,,"Dargida rubripennis","The Pink-streak",Iowa,Story,2019-08-17,3:30,"Ames, Paul",42.02064,-93.623952,"Paul Martsching",adult,"Building Light",Sighting,1,,,,,,,,,
244525,,,,"Dargida rubripennis","The Pink-streak",Iowa,Story,2019-08-19,3:30,"Ames, Paul",42.02064,-93.623952,"Paul Martsching",adult,"Building Light",Sighting,1,,,,,,,,,
244526,,,,"Dargida rubripennis","The Pink-streak",Iowa,Story,2019-08-23,3:30,"Ames, Paul",42.02064,-93.623952,"Paul Martsching",adult,"Building Light",Sighting,2,,,,,,,,,
244527,,,,"Dargida rubripennis","The Pink-streak",Iowa,Story,2019-08-29,3:30,"Ames, Paul",42.02064,-93.623952,"Paul Martsching",adult,"Building Light",Sighting,1,,,,,,,,,
245886,,,,"Dargida rubripennis","The Pink-streak",Iowa,Story,2019-08-05,3:30,"Ames, Paul",42.02064,-93.623952,"Paul Martsching",adult,"Building Light",Sighting,1,,,,,,,,,
245887,,,,"Dargida rubripennis","The Pink-streak",Iowa,Story,2019-08-17,3:30,"Ames, Paul",42.02064,-93.623952,"Paul Martsching",adult,"Building Light",Sighting,1,,,,,,,,,
245888,,,,"Dargida rubripennis","The Pink-streak",Iowa,Story,2019-08-19,3:30,"Ames, Paul",42.02064,-93.623952,"Paul Martsching",adult,"Building Light",Sighting,1,,,,,,,,,
245889,,,,"Dargida rubripennis","The Pink-streak",Iowa,Story,2019-08-23,3:30,"Ames, Paul",42.02064,-93.623952,"Paul Martsching",adult,"Building Light",Sighting,2,,,,,,,,,
245890,,,,"Dargida rubripennis","The Pink-streak",Iowa,Story,2019-08-29,3:30,"Ames, Paul",42.02064,-93.623952,"Paul Martsching",adult,"Building Light",Sighting,1,,,,,,,,,
280183,,,,"Dargida rubripennis","The Pink-streak",Iowa,Story,2020-07-28,,"Ames, Paul",42.011454,-93.615063,"Paul Martsching",adult,"Building Light",Sighting,1,,,,,,,,,
280184,,,,"Dargida rubripennis","The Pink-streak",Iowa,Story,2020-08-06,,"Ames, Paul",42.011454,-93.615063,"Paul Martsching",adult,"Building Light",Sighting,2,,,,,,,,,
280185,,,,"Dargida rubripennis","The Pink-streak",Iowa,Story,2020-08-16,,"Ames, Paul",42.011454,-93.615063,"Paul Martsching",adult,"Building Light",Sighting,1,,,,,,,,,
280186,,,,"Dargida rubripennis","The Pink-streak",Iowa,Story,2020-08-25,,"Ames, Paul",42.011454,-93.615063,"Paul Martsching",adult,"Building Light",Sighting,1,,,,,,,,,
280187,,,,"Dargida rubripennis","The Pink-streak",Iowa,Story,2020-08-26,,"Ames, Paul",42.011454,-93.615063,"Paul Martsching",adult,"Building Light",Sighting,1,,,,,,,,,
313026,,,,"Dargida rubripennis","The Pink-streak",Iowa,Story,2022-08-11,21:45,"Ada Hayden Heritage Park",42.062273,-93.62472,"Wolfgang Oesterreich",adult,sighting,photograph,1,72°,84%,67°,"6 mph",East,30.15,cloudy,,"During a ""black-light"" session at Ada Hayden Heritage Park (led by Gregory Courtney): Ames, IA"
