ID,"Collection / Source","Catalog Number","Specify Number",Taxon,"Common Name",State,County,Date,Time,Locale,Latitude,Longitude,Collector,"Life Stage","Collection Method","Preparation Type",Count,Temperature,Humidity,"Dew Point",Wind,"Wind Direction","Barometric Pressure",Sky,"Moon Phase",Notes
32647,,2014-033019,SPM025323,"Iridopsis defectaria","Brown Shaded Gray Moth",Iowa,Polk,2011-05-18,,"Puccoon Prairie",41.73528,-93.36417,"Keith Summerville",adult,,Sighting,1,,,,,,,,,
32648,,2014-033020,SPM025796,"Iridopsis defectaria","Brown Shaded Gray Moth",Iowa,Polk,2011-05-18,,"Chichaqua Bottoms Sandhill Prairie",41.77278,-93.385,"Keith Summerville",adult,,Sighting,1,,,,,,,,,
32649,,2014-033021,SPM026034,"Iridopsis defectaria","Brown Shaded Gray Moth",Iowa,Polk,2011-05-18,,"Chichaqua Bottoms Sandhill Prairie",41.77167,-93.38361,"Keith Summerville",adult,,Sighting,1,,,,,,,,,
69274,,2014-069881,,"Iridopsis defectaria","Brown Shaded Gray Moth",Iowa,Polk,2005-05-25,,"Big Creek State Park",41.807055,-93.745185,"Keith Summerville",adult,,Sighting,1,,,,,,,,,
69275,,2014-069882,,"Iridopsis defectaria","Brown Shaded Gray Moth",Iowa,Polk,2005-05-25,,"Thomas Mitchell Park",41.64,-93.3823,"Keith Summerville",adult,,Sighting,1,,,,,,,,,
69276,,2014-069883,,"Iridopsis defectaria","Brown Shaded Gray Moth",Iowa,Polk,2006-05-25,,"Thomas Mitchell Park",41.64,-93.3823,"Keith Summerville",adult,,Sighting,2,,,,,,,,,
69277,,2014-069884,,"Iridopsis defectaria","Brown Shaded Gray Moth",Iowa,Polk,2006-05-25,,"Chichaqua Bottoms Sandhill Prairie",41.77278,-93.385,"Keith Summerville",adult,,Sighting,1,,,,,,,,,
249178,,,,"Iridopsis defectaria","Brown Shaded Gray Moth",Iowa,Polk,2011-07-29,,"McFarland Park",42.094913,-93.572816,"Moni Hayne",adult,Blacklight/Fluorescent,Photograph,1,,,,,,,,,
335796,,,,"Iridopsis defectaria","Brown Shaded Gray Moth",Iowa,Polk,2023-06-25,21:56:08,"Yellow Banks Park",41.548183631667,-93.473158521667,"Jim Durbin",adult,Blacklight/Fluorescent,Photograph,1,73,67,61,11,270,29.81,clear,"40% visible",
335845,,,,"Iridopsis defectaria","Brown Shaded Gray Moth",Iowa,Polk,2023-06-25,22:12:23,"Yellow Banks Park",41.548183631667,-93.473158521667,"Jim Durbin",adult,Blacklight/Fluorescent,Photograph,1,73,67,61,11,270,29.81,clear,"40% visible",
