ID,"Collection / Source","Catalog Number","Specify Number",Taxon,"Common Name",State,County,Date,Time,Locale,Latitude,Longitude,Collector,"Life Stage","Collection Method","Preparation Type",Count,Temperature,Humidity,"Dew Point",Wind,"Wind Direction","Barometric Pressure",Sky,"Moon Phase",Notes
5379,,2014-005660,,"Polygonia interrogationis","Question Mark",Iowa,Polk,1950-06-30,,"Polk County",41.627842,-93.500343," USGS - NPWRC",adult,Sighting,Sighting,1,,,,,,,,,"HIstorical Record"
7353,,2014-007634,,"Polygonia interrogationis","Question Mark",Iowa,Polk,2010-07-31,,"Chichaqua Bottoms Greenbelt",41.7958,-93.413,"Aaron Brees",adult,Sighting,Photograph,2,,,,,,,,,
7354,,2014-007635,,"Polygonia interrogationis","Question Mark",Iowa,Polk,2011-07-08,,"Chichaqua Bottoms Greenbelt",41.7958,-93.413,"Aaron Brees",adult,Sighting,Photograph,1,,,,,,,,,
7363,,2014-007644,,"Polygonia interrogationis","Question Mark",Iowa,Polk,2010-11-07,,Redacted,Redacted,Redacted,"Aaron Brees",adult,Sighting,Sighting,1,,,,,,,,,
61859,,2014-062460,,"Polygonia interrogationis","Question Mark",Iowa,Polk,2005-08-10,,"Chichaqua Bottoms Sandhill Prairie",41.76717,-93.37483,"Frank Olsen",adult,Sighting,Sighting,1,,,,,,,,,
64977,,2014-065578,,"Polygonia interrogationis","Question Mark",Iowa,Polk,2014-06-24,,"Red Feather Prairie",41.7235644,-93.6682057,IBSN,adult,Sighting,Sighting,1,,,,,,,,,
129310,,2015-019900,,"Polygonia interrogationis","Question Mark",Iowa,Polk,2015-08-17,,"Big Creek State Park",41.807055,-93.745185,"Mark Brown",adult,Sighting,Sighting,1,,,,,,,,,
140233,,2016-004810,,"Polygonia interrogationis","Question Mark",Iowa,Polk,2015-07-02,,"Jester Park",41.786297,-93.788656,IBSN,adult,Sighting,Sighting,1,70,,,,,,Overcast,,
140249,,2016-004826,,"Polygonia interrogationis","Question Mark",Iowa,Polk,2015-08-20,,"Jester Park",41.786297,-93.788656,IBSN,adult,Sighting,Sighting,1,76,,,,,,Clear,,
140266,,2016-004843,,"Polygonia interrogationis","Question Mark",Iowa,Polk,2015-06-14,,"Jester Park",41.78047,-93.794776,IBSN,adult,Sighting,Sighting,2,76,,,,,,"Mostly Clear",,"Prairie,Woodland,Pasture/Roadside"
140811,,2016-005392,,"Polygonia interrogationis","Question Mark",Iowa,Polk,2014-06-24,,"Red Feather Prairie",41.724028,-93.671574,IBSN,adult,Sighting,Sighting,1,74,,,,,,"Mostly Clear",,"Restored Prairie,Ponded Drainage Area,Edge (wet prairie/woodland)"
140879,,2016-005460,,"Polygonia interrogationis","Question Mark",Iowa,Polk,2015-07-30,,"Red Feather Prairie",41.724028,-93.671574,IBSN,adult,Sighting,Sighting,1,80,,,,,,"Mostly Clear",,"Restored Prairie,Ponded Drainage Area,Edge (wet prairie/woodland)"
144116,,2016-008481,,"Polygonia interrogationis","Question Mark",Iowa,Polk,2015-08-15,,"Big Creek State Park",41.807055,-93.745185,"Mark Brown",adult,Sighting,Photograph,1,,,,,,,,,
189827,,2017-007788,,"Polygonia interrogationis","Question Mark",Iowa,Polk,2016-06-24,,"Jester Park",41.7894,-93.7824,"IBSN ",adult,Sighting,Sighting,1,77,,,"Relatively Still",,,Clear,,
189865,,2017-007826,,"Polygonia interrogationis","Question Mark",Iowa,Polk,2016-08-05,,"Jester Park",41.7894,-93.7824,"IBSN ",adult,Sighting,Sighting,3,79,,,"Relatively Still",,,Clear,,
190709,,2017-008670,,"Polygonia interrogationis","Question Mark",Iowa,Polk,2016-10-02,,"Thomas Mitchell Park",41.64,-93.3823,"IBSN ",adult,Sighting,Sighting,1,68,,,"Moderately Windy",,,"Mostly Cloudy",,"edge;prairie;upland forest;stream bank;prairie"
261453,,,,"Polygonia interrogationis","Question Mark",Iowa,Polk,2019-07-30,16:40,"Big Creek State Park",41.802522,-93.733288,IBSN,adult,Sighting,Sighting,1,77,,,"Relatively Still",,,"Mostly Cloudy",,
261522,,,,"Polygonia interrogationis","Question Mark",Iowa,Polk,2019-08-06,14:38,"Jester Park",41.782477,-93.787738,IBSN,adult,Sighting,Sighting,2,84,,,"Relatively Still",,,"Mostly Clear",,
261577,,,,"Polygonia interrogationis","Question Mark",Iowa,Polk,2019-06-20,12:43,"Red Feather Prairie",41.723743,-93.671574,IBSN,adult,Sighting,Sighting,1,22,,,Calm,,,"Mostly Clear",,
261595,,,,"Polygonia interrogationis","Question Mark",Iowa,Polk,2017-07-01,15:08,"Thomas Mitchell Park",41.64,-93.3823,IBSN,adult,Sighting,Sighting,1,79,,,"Moderately Windy",,,Overcast,,
261596,,,,"Polygonia interrogationis","Question Mark",Iowa,Polk,2018-08-05,12:37,"Thomas Mitchell Park",41.64,-93.3823,IBSN,adult,Sighting,Sighting,1,84,,,"Moderately Windy",,,"Mostly Cloudy",,
261597,,,,"Polygonia interrogationis","Question Mark",Iowa,Polk,2019-07-14,12:10,"Thomas Mitchell Park",41.64,-93.3823,IBSN,adult,Sighting,Sighting,1,88,,,"Relatively Still",,,"Mostly Clear",,
261598,,,,"Polygonia interrogationis","Question Mark",Iowa,Polk,2019-08-04,12:50,"Thomas Mitchell Park",41.64,-93.3823,IBSN,adult,Sighting,Sighting,1,84,,,"Relatively Still",,,"Mostly Clear",,
261599,,,,"Polygonia interrogationis","Question Mark",Iowa,Polk,2019-08-04,12:50,"Thomas Mitchell Park",41.64,-93.3823,IBSN,adult,Sighting,Sighting,2,84,,,"Relatively Still",,,"Mostly Clear",,
275392,,,,"Polygonia interrogationis","Question Mark",Iowa,Polk,2020-07-27,,"Chichaqua Bottoms Sandhill Prairie",41.775593,-93.379902,"Jay Gilliam",adult,Sighting,Sighting,1,,,,,,,,,
306604,,,,"Polygonia interrogationis","Question Mark",Iowa,Polk,2021-08-23,15:00,"Easter Lake",41.542842,-93.571552,IBSN,adult,Sighting,Sighting,2,89,,,,,,"Mostly Clear",,
306616,,,,"Polygonia interrogationis","Question Mark",Iowa,Polk,2021-08-06,11:08,"Easter Lake",41.545422,-93.56662,IBSN,adult,Sighting,Sighting,2,81,,,,,,"Mostly Clear",,
330437,,,,"Polygonia interrogationis","Question Mark",Iowa,Polk,2022-07-14,,"Brown's Woods",41.54237,-93.70455,IBSN,adult,Sighting,Sighting,1,87,,,"Relatively Still",,,Clear,,
330438,,,,"Polygonia interrogationis","Question Mark",Iowa,Polk,2022-08-22,,"Brown's Woods",41.54237,-93.70455,IBSN,adult,Sighting,Sighting,1,80,,,Calm,,,"Partly Cloudy",,
330442,,,,"Polygonia interrogationis","Question Mark",Iowa,Polk,2022-09-18,,"Easter Lake",41.545422,-93.56662,IBSN,adult,Sighting,Sighting,1,74,,,Calm,,,"Partly Cloudy",,
330443,,,,"Polygonia interrogationis","Question Mark",Iowa,Polk,2022-07-02,,"Easter Lake",41.545422,-93.56662,IBSN,adult,Sighting,Sighting,3,84,,,"Relatively Still",,,"Mostly Clear",,
330444,,,,"Polygonia interrogationis","Question Mark",Iowa,Polk,2022-07-03,,"Easter Lake",41.545422,-93.56662,IBSN,adult,Sighting,Sighting,2,84,,,"Relatively Still",,,"Mostly Cloudy",,
330445,,,,"Polygonia interrogationis","Question Mark",Iowa,Polk,2022-07-09,,"Easter Lake",41.545422,-93.56662,IBSN,adult,Sighting,Sighting,2,84,,,"Relatively Still",,,"Mostly Clear",,
330446,,,,"Polygonia interrogationis","Question Mark",Iowa,Polk,2022-07-24,,"Easter Lake",41.545422,-93.56662,IBSN,adult,Sighting,Sighting,3,79,,,"Moderately Windy",,,"Mostly Clear",,
330454,,,,"Polygonia interrogationis","Question Mark",Iowa,Polk,2022-07-07,,"Jester Park",41.786297,-93.788656,IBSN,adult,Sighting,Sighting,1,78,,,Calm,,,"Mostly Cloudy",,
346833,,,,"Polygonia interrogationis","Question Mark",Iowa,Polk,2023-07-15,,"Chichaqua Bottoms Greenbelt",41.788043,-93.417797,"Jay Gilliam",adult,Sighting,Sighting,1,,,,,,,,,
347077,,,,"Polygonia interrogationis","Question Mark",Iowa,Polk,2023-09-10,,"Dale Maffitt Reservoir",41.514565,-93.783519,"Jay Gilliam",adult,Sighting,Sighting,1,,,,,,,,,
362146,,,,"Polygonia interrogationis","Question Mark",Iowa,Polk,2023-06-13,,"Jester Park",41.786753,-93.792568,IBSN,adult,Sighting,Sighting,1,,,,"Moderately Windy",,,Clear,,
362158,,,,"Polygonia interrogationis","Question Mark",Iowa,Polk,2023-07-17,,"Jester Park",41.786753,-93.792568,IBSN,adult,Sighting,Sighting,1,,,,Calm,,,"Mostly Clear",,
365677,,,,"Polygonia interrogationis","Question Mark",Iowa,Polk,2023-06-21,,"Brown's Woods",41.54237,-93.70455,IBSN,adult,Sighting,Sighting,1,,,,"Relatively Still",,,"Mostly Clear",,
365678,,,,"Polygonia interrogationis","Question Mark",Iowa,Polk,2023-06-21,,"Brown's Woods",41.54237,-93.70455,IBSN,adult,Sighting,Sighting,7,,,,"Relatively Still",,,"Mostly Clear",,
365682,,,,"Polygonia interrogationis","Question Mark",Iowa,Polk,2023-07-04,,"Chichaqua Wildlife Viewing Area",41.754008,-93.382751,IBSN,adult,Sighting,Sighting,1,,,,Calm,,,"Partly Cloudy",,
365687,,,,"Polygonia interrogationis","Question Mark",Iowa,Polk,2023-07-21,,"Jester Park",41.786753,-93.792568,IBSN,adult,Sighting,Sighting,2,,,,Calm,,,"Partly Cloudy",,
