ID,"Collection / Source","Catalog Number","Specify Number",Taxon,"Common Name",State,County,Date,Time,Locale,Latitude,Longitude,Collector,"Life Stage","Collection Method","Preparation Type",Count,Temperature,Humidity,"Dew Point",Wind,"Wind Direction","Barometric Pressure",Sky,"Moon Phase",Notes
1449,,2014-001449,,"Phalaenostola metonalis","Pale Phalaenostola Moth",Iowa,Linn,2014-07-31,,"Pleasant Creek State Recreation Area, Linn County",42.110327,-91.822988,"Jim Durbin",adult,Blacklight/Fluorescent,Photograph,1,,,,,,,,,
10732,,2014-011014,,"Phalaenostola metonalis","Pale Phalaenostola Moth",Iowa,Linn,2014-08-08,2030-2300DST,"Pleasant Creek State Recreation Area, Linn County",42.110327,-91.822988,"Jim Durbin",adult,Blacklight/Fluorescent,Photograph,1,72-69,79,62,Calm,,30.04,Clear,,
41405,,2014-041782,SPM030901,"Phalaenostola metonalis","Pale Phalaenostola Moth",Iowa,Linn,2012-07-22,,"Wakpicada Natural Area",42.18892,-91.52035,"Jim Durbin",adult,Blacklight/Fluorescent,Photograph,1,,,,,,,,,
41413,,2014-041790,SPM040848,"Phalaenostola metonalis","Pale Phalaenostola Moth",Iowa,Linn,2014-06-17,,"Pleasant Creek State Recreation Area, Linn County",42.10948,-91.8249,"Jim Durbin",adult,Blacklight/Fluorescent,Photograph,1,,,,,,,,,
41414,,2014-041791,SPM042479,"Phalaenostola metonalis","Pale Phalaenostola Moth",Iowa,Linn,2014-07-18,,"Pleasant Creek State Recreation Area, Linn County",42.10948,-91.8249,"Jim Durbin",adult,Blacklight/Fluorescent,Photograph,1,,,,,,,,,
49606,,2014-049987,SPM029268,"Phalaenostola metonalis","Pale Phalaenostola Moth",Iowa,Linn,2012-06-22,,"Behren's Pond Woodland State Preserve",42.118214,-91.754324,"Jim Durbin",adult,Blacklight/Fluorescent,Photograph,1,,,,,,,,,
49607,,2014-049988,SPM029273,"Phalaenostola metonalis","Pale Phalaenostola Moth",Iowa,Linn,2012-06-22,,"Behren's Pond Woodland State Preserve",42.118214,-91.754324,"Jim Durbin",adult,Blacklight/Fluorescent,Photograph,1,,,,,,,,,
49627,,2014-050008,SPM029366,"Phalaenostola metonalis","Pale Phalaenostola Moth",Iowa,Linn,2012-06-22,,"Behren's Pond Woodland State Preserve",42.118214,-91.754324,"Jim Durbin",adult,Blacklight/Fluorescent,Photograph,1,,,,,,,,,
126416,,2015-016984,,"Phalaenostola metonalis","Pale Phalaenostola Moth",Iowa,Linn,2015-06-05,2100-2315,"Wanatee County Park",42.01026,-91.57381,"Jim Durbin",adult,Blacklight/Fluorescent,Photograph,1,78,79,58,16,90,30.1,clear,"90% Moon visible",
126444,,2015-017012,,"Phalaenostola metonalis","Pale Phalaenostola Moth",Iowa,Linn,2015-06-05,2100-2315,"Wanatee County Park",42.01026,-91.57381,"Jim Durbin",adult,Blacklight/Fluorescent,Photograph,1,78,79,58,16,90,30.1,clear,"90% Moon visible",
126622,,2015-017190,,"Phalaenostola metonalis","Pale Phalaenostola Moth",Iowa,Linn,2015-06-08,2100-2315,"Matsell Bridge Natural Area",42.131959,-91.388307,"Jim Durbin",adult,Blacklight/Fluorescent,Photograph,1,77,49,56,0,210,29.78,clear,"55% visible",
126630,,2015-017198,,"Phalaenostola metonalis","Pale Phalaenostola Moth",Iowa,Linn,2015-06-08,2100-2315,"Matsell Bridge Natural Area",42.131959,-91.388307,"Jim Durbin",adult,Blacklight/Fluorescent,Photograph,1,77,49,56,0,210,29.78,clear,"55% visible",
127059,,2015-017621,,"Phalaenostola metonalis","Pale Phalaenostola Moth",Iowa,Linn,2015-06-16,"2100 to 2300","Wickiup Hill Outdoor Learning Area",42.087567,-91.767578,"Jim Durbin",adult,Blacklight/Fluorescent,Photograph,1,72,65,60,1,90,30.02,clear,"0% visible",
127067,,2015-017629,,"Phalaenostola metonalis","Pale Phalaenostola Moth",Iowa,Linn,2015-06-16,"2100 to 2300","Wickiup Hill Outdoor Learning Area",42.087567,-91.767578,"Jim Durbin",adult,Blacklight/Fluorescent,Photograph,1,72,65,60,1,90,30.02,clear,"0% visible",
168146,,2016-032891,,"Phalaenostola metonalis","Pale Phalaenostola Moth",Iowa,Linn,2016-05-31,1030-2300,"Hitaga Sand Ridge Prairie Preserve",42.250957,-91.632098,"Jim Durbin",adult,Blacklight/Florescent,Photograph,1,66,100,65,0,0,29.89,cloudy,"30% visible","1030-2300. Rained for about 45 minutes."
168155,,2016-032900,,"Phalaenostola metonalis","Pale Phalaenostola Moth",Iowa,Linn,2016-05-31,1030-2300,"Hitaga Sand Ridge Prairie Preserve",42.250957,-91.632098,"Jim Durbin",adult,Blacklight/Florescent,Photograph,1,66,100,65,0,0,29.89,cloudy,"30% visible","1030-2300. Rained for about 45 minutes."
168865,,2016-033610,,"Phalaenostola metonalis","Pale Phalaenostola Moth",Iowa,Linn,2016-06-05,2045-2300,"Vecny Woods",41.956725,-91.600854,"Jim Durbin",adult,Blacklight/Fluorescent,Photograph,1,80,36,51,4,300,29.67,"partly cloudy","dark phase",
168867,,2016-033612,,"Phalaenostola metonalis","Pale Phalaenostola Moth",Iowa,Linn,2016-06-05,2045-2300,"Vecny Woods",41.956725,-91.600854,"Jim Durbin",adult,Blacklight/Fluorescent,Photograph,1,80,36,51,4,300,29.67,"partly cloudy","dark phase",
169566,,2016-034311,,"Phalaenostola metonalis","Pale Phalaenostola Moth",Iowa,Linn,2016-06-15,2100-2315,"Hitaga Sand Ridge Prairie Preserve",42.250957,-91.632098,"Jim Durbin",adult,Blacklight/Fluorescent,Photograph,1,83,56,66,8,310,29.74,clear,"90% visible",
173448,,2016-038198,,"Phalaenostola metonalis","Pale Phalaenostola Moth",Iowa,Linn,2016-08-03,2100-2330,"Hitaga Sand Ridge Prairie Preserve",42.250957,-91.632098,"Jim Durbin",adult,Blacklight/Fluorescent,Photograph,1,81,74,71,3,180,29.96,clear,Dark,
176740,,2016-041490,,"Phalaenostola metonalis","Pale Phalaenostola Moth",Iowa,Linn,2016-09-17,,"Hitaga Sand Ridge Prairie Preserve",42.250957,-91.632098,"Jim Durbin",adult,Blacklight/Fluorescent,Photograph,1,68,67,56,0,0,29.88,clear,"100% visible",
192036,,2017-009997,,"Phalaenostola metonalis","Pale Phalaenostola Moth",Iowa,Linn,2017-05-31,2030-2300,"Hitaga Sand Ridge Prairie Preserve",42.250957,-91.632098,"Jim Durbin",adult,Blacklight/Fluorescent,Photograph,1,65,43,42,5,0,29.98,clear,"40% visible",
192584,,2017-010545,,"Phalaenostola metonalis","Pale Phalaenostola Moth",Iowa,Linn,2017-06-14,2100-2330,"Wickiup Hill Outdoor Learning Area",42.087567,-91.767578,"Jim Durbin",adult,Blacklight/Fluorescent,Photograph,1,80,73,71,3,120,29.75,cloudy,"90% visible",
192737,,2017-010699,,"Phalaenostola metonalis","Pale Phalaenostola Moth",Iowa,Linn,2017-06-24,2045-2300,"Hitaga Sand Ridge Prairie Preserve",42.250957,-91.632098,"Jim Durbin",adult,Blacklight/Fluorescent,Photograph,1,65,43,46,13,280,30.14,clear,new,
192753,,2017-010716,,"Phalaenostola metonalis","Pale Phalaenostola Moth",Iowa,Linn,2017-06-24,2045-2300,"Hitaga Sand Ridge Prairie Preserve",42.250957,-91.632098,"Jim Durbin",adult,Blacklight/Fluorescent,Photograph,1,65,43,46,13,280,30.14,clear,new,
192761,,2017-010724,,"Phalaenostola metonalis","Pale Phalaenostola Moth",Iowa,Linn,2017-06-24,2045-2300,"Hitaga Sand Ridge Prairie Preserve",42.250957,-91.632098,"Jim Durbin",adult,Blacklight/Fluorescent,Photograph,1,65,43,46,13,280,30.14,clear,new,
192781,,2017-010744,,"Phalaenostola metonalis","Pale Phalaenostola Moth",Iowa,Linn,2017-06-24,2045-2300,"Hitaga Sand Ridge Prairie Preserve",42.250957,-91.632098,"Jim Durbin",adult,Blacklight/Fluorescent,Photograph,1,65,43,46,13,280,30.14,clear,new,
192798,,2017-010761,,"Phalaenostola metonalis","Pale Phalaenostola Moth",Iowa,Linn,2017-06-24,2045-2300,"Hitaga Sand Ridge Prairie Preserve",42.250957,-91.632098,"Jim Durbin",adult,Blacklight/Fluorescent,Photograph,1,65,43,46,13,280,30.14,clear,new,
192855,,2017-010819,,"Phalaenostola metonalis","Pale Phalaenostola Moth",Iowa,Linn,2017-06-24,2045-2300,"Hitaga Sand Ridge Prairie Preserve",42.250957,-91.632098,"Jim Durbin",adult,Blacklight/Fluorescent,Photograph,1,65,43,46,13,280,30.14,clear,new,
192917,,2017-010882,,"Phalaenostola metonalis","Pale Phalaenostola Moth",Iowa,Linn,2017-06-24,2045-2300,"Hitaga Sand Ridge Prairie Preserve",42.250957,-91.632098,"Jim Durbin",adult,Blacklight/Fluorescent,Photograph,1,65,43,46,13,280,30.14,clear,new,
193080,,2017-011045,,"Phalaenostola metonalis","Pale Phalaenostola Moth",Iowa,Linn,2017-07-01,,"Hitaga Sand Ridge Prairie Preserve",42.250957,-91.632098,"Jim Durbin",adult,Blacklight/Fluorescent,Photograph,1,72,56,55,280,9,29.97,clear,,
193096,,2017-011061,,"Phalaenostola metonalis","Pale Phalaenostola Moth",Iowa,Linn,2017-07-01,,"Hitaga Sand Ridge Prairie Preserve",42.250957,-91.632098,"Jim Durbin",adult,Blacklight/Fluorescent,Photograph,1,72,56,55,280,9,29.97,clear,,
194571,,2017-012536,,"Phalaenostola metonalis","Pale Phalaenostola Moth",Iowa,Linn,2017-07-29,2045-2315,"Hitaga Sand Ridge Prairie Preserve",42.250957,-91.632098,"Jim Durbin",adult,Blacklight/Fluorescent,Photograph,1,69,73,61,0,0,30.09,clear,"40% visible",
194616,,2017-012581,,"Phalaenostola metonalis","Pale Phalaenostola Moth",Iowa,Linn,2017-07-29,2045-2315,"Hitaga Sand Ridge Prairie Preserve",42.250957,-91.632098,"Jim Durbin",adult,Blacklight/Fluorescent,Photograph,1,69,73,61,0,0,30.09,clear,"40% visible",
195442,,2017-013406,,"Phalaenostola metonalis","Pale Phalaenostola Moth",Iowa,Linn,2017-08-14,2030-2300,"Hitaga Sand Ridge Prairie Preserve",42.250957,-91.632098,"Jim Durbin",adult,Blacklight/Fluorescent,Photograph,1,72,97,71,0,0,29.81,clear,"60% visible",
195870,,2017-013834,,"Phalaenostola metonalis","Pale Phalaenostola Moth",Iowa,Linn,2017-08-23,2000-2300,"Hitaga Sand Ridge Prairie Preserve",42.250957,-91.632098,"Jim Durbin",adult,Blacklight/Fluorescent,Photograph,1,66,84,61,,,30.03,clear,"0 visible",
196260,,2017-014192,,"Phalaenostola metonalis","Pale Phalaenostola Moth",Iowa,Linn,2017-08-30,2000-2300,"Hitaga Sand Ridge Prairie Preserve",42.250957,-91.632098,"Jim Durbin",adult,Blacklight/Fluorescent,Photograph,1,70,90,68,0,0,30.07,clear,"50% visible",
200232,,2017-018163,,"Phalaenostola metonalis","Pale Phalaenostola Moth",Iowa,Linn,2016-08-03,,"Hitaga Sand Ridge Prairie Preserve",42.250957,-91.632098,"Don F. Becker",adult,,Photograph,1,,,,,,,,,
211658,,2018-009815,,"Phalaenostola metonalis","Pale Phalaenostola Moth",Iowa,Linn,2018-06-06,2030-2315,"Wickiup Hill Outdoor Learning Area",42.087352,-91.767107,"Jim Durbin",adult,Blacklight/Fluorescent,Photograph,1,74,69,64,5,280,29.83,cloudy,"50% visible",
212186,,2018-010343,,"Phalaenostola metonalis","Pale Phalaenostola Moth",Iowa,Linn,2018-06-11,2100-2300,"Hitaga Sand Ridge Prairie Preserve",42.250957,-91.632098,"Jim Durbin",adult,Blacklight/Fluorescent,Photograph,1,68,84,63,7,90,29.89,cloudy,"10% visible",
212426,,2018-010582,,"Phalaenostola metonalis","Pale Phalaenostola Moth",Iowa,Linn,2018-06-15,2100-2315,"Wickiup Hill Outdoor Learning Area",42.087352,-91.767107,"Jim Durbin",adult,Blacklight/Florescent,Photograph,1,84,70,73,3,120,29.79,"partly cloudy","0 % visible",
218133,,2018-016289,,"Phalaenostola metonalis","Pale Phalaenostola Moth",Iowa,Linn,2018-08-08,2045-2315,"Hitaga Sand Ridge Prairie Preserve",42.250957,-91.632098,"Jim Durbin",adult,Blacklight/Fluorescent,Photograph,1,73,83,68,6,210,29.93,clear,"10 % visible",
237721,,,,"Phalaenostola metonalis","Pale Phalaenostola Moth",Iowa,Linn,2019-08-24,2030-2300,"Hitaga Sand Ridge Prairie Preserve",42.250957,-91.632098,"Jim Durbin",adult,Blacklight/Fluorescent,Photograph,1,65,71,56,2,90,30.01,"partly cloudy","50% visible",
267004,,,,"Phalaenostola metonalis","Pale Phalaenostola Moth",Iowa,Linn,2020-06-12,21:12:03,"Hitaga Sand Ridge Prairie Preserve",42.2508675,-91.63209427,"Jim Durbin",adult,Blacklight/Fluorescent,Photograph,1,76,48,55,0,0,30.17,"partly cloudy","80% visible",
267074,,,,"Phalaenostola metonalis","Pale Phalaenostola Moth",Iowa,Linn,2020-06-12,20:53:05,"Hitaga Sand Ridge Prairie Preserve",42.2508675,-91.63209427,"Jim Durbin",adult,Blacklight/Fluorescent,Photograph,1,76,48,55,0,0,30.17,"partly cloudy","80% visible",
268587,,,,"Phalaenostola metonalis","Pale Phalaenostola Moth",Iowa,Linn,2020-06-07,17:05:05,"Matsell Bridge Natural Area",42.14206884,-91.38798282,"Mark Brown",adult,"Building Light",Photograph,1,,,,,,,,,
268826,,,,"Phalaenostola metonalis","Pale Phalaenostola Moth",Iowa,Linn,2020-07-24,22:12:04,"Wickiup Hill Outdoor Learning Area",42.08807239,-91.76755076,"Jim Durbin",adult,Blacklight/Fluorescent,Photograph,1,80,76,72,4,120,29.6,clear,"20% visible",
269692,,,,"Phalaenostola metonalis","Pale Phalaenostola Moth",Iowa,Linn,2020-08-08,22:53:11,"Hitaga Sand Ridge Prairie Preserve",42.25088607,-91.63213435,"Jim Durbin",adult,Blacklight/Fluorescent,Photograph,1,78,81,71,7,180,30.02,clear,"80% visible",
269709,,,,"Phalaenostola metonalis","Pale Phalaenostola Moth",Iowa,Linn,2020-08-08,22:50:41,"Hitaga Sand Ridge Prairie Preserve",42.25088607,-91.63213435,"Jim Durbin",adult,Blacklight/Fluorescent,Photograph,1,78,81,71,7,180,30.02,clear,"80% visible",
269875,,,,"Phalaenostola metonalis","Pale Phalaenostola Moth",Iowa,Linn,2020-08-08,21:47:31,"Hitaga Sand Ridge Prairie Preserve",42.25088607,-91.63213435,"Jim Durbin",adult,Blacklight/Fluorescent,Photograph,1,78,81,71,7,180,30.02,clear,"80% visible",
270527,,,,"Phalaenostola metonalis","Pale Phalaenostola Moth",Iowa,Linn,2020-08-26,21:56:28,"1460 Douglas Ct, Marion",42.040069,-91.590953,"Jim Durbin",adult,"Building Light",Photograph,1,,,,,,,,,
270775,,,,"Phalaenostola metonalis","Pale Phalaenostola Moth",Iowa,Linn,2020-08-29,22:06:26,"Hitaga Sand Ridge Prairie Preserve",42.25085584,-91.63207192,"Jim Durbin",adult,Blacklight/Fluorescent,Photograph,1,64,64,52,5,350,29.91,clear,"90% visible",
296425,,,,"Phalaenostola metonalis","Pale Phalaenostola Moth",Iowa,Linn,2021-08-29,8:28:18,"Hitaga Sand Ridge Prairie Preserve",42.2503381,-91.63365785,"Mark Brown",adult,Sighting,Photograph,1,,,,,,,,,
302354,"Jim Durbin Drawer 114",2021-000597,,"Phalaenostola metonalis","Pale Phalaenostola Moth",Iowa,Linn,2007-08-20,,"1460 Douglas Ct, Marion",42.040069,-91.590953,"Jim Durbin",adult,Blacklight/Florescent,Pinned,1,,,,,,,,,
313492,,,,"Phalaenostola metonalis","Pale Phalaenostola Moth",Iowa,Linn,2022-08-17,22:41:40,"Wanatee County Park",42.01012074,-91.56658753,"Jim Durbin",adult,Blacklight/Fluorescent,Photograph,1,68,91,65,0,0,30.08,clear,"80% visible",
313561,,,,"Phalaenostola metonalis","Pale Phalaenostola Moth",Iowa,Linn,2022-08-17,22:19:17,"Wanatee County Park",42.01012074,-91.56658753,"Jim Durbin",adult,Blacklight/Fluorescent,Photograph,1,68,91,65,0,0,30.08,clear,"80% visible",
313578,,,,"Phalaenostola metonalis","Pale Phalaenostola Moth",Iowa,Linn,2022-08-17,21:54:56,"Wanatee County Park",42.01012074,-91.56658753,"Jim Durbin",adult,Blacklight/Fluorescent,Photograph,1,68,91,65,0,0,30.08,clear,"80% visible",
313620,,,,"Phalaenostola metonalis","Pale Phalaenostola Moth",Iowa,Linn,2022-08-17,21:29:20,"Wanatee County Park",42.01012074,-91.56658753,"Jim Durbin",adult,Blacklight/Fluorescent,Photograph,1,68,91,65,0,0,30.08,clear,"80% visible",
313720,,,,"Phalaenostola metonalis","Pale Phalaenostola Moth",Iowa,Linn,2022-08-25,22:27:03,"Hitaga Sand Ridge Prairie Preserve",42.25103416,-91.63218888,"Jim Durbin",adult,Blacklight/Fluorescent,Photograph,1,73,90,70,2,350,30.03,clear,"10% visible",
313779,,,,"Phalaenostola metonalis","Pale Phalaenostola Moth",Iowa,Linn,2022-08-25,21:56:02,"Hitaga Sand Ridge Prairie Preserve",42.25103416,-91.63218888,"Jim Durbin",adult,Blacklight/Fluorescent,Photograph,1,73,90,70,2,350,30.03,clear,"10% visible",
313793,,,,"Phalaenostola metonalis","Pale Phalaenostola Moth",Iowa,Linn,2022-08-25,21:52:24,"Hitaga Sand Ridge Prairie Preserve",42.25103416,-91.63218888,"Jim Durbin",adult,Blacklight/Fluorescent,Photograph,1,73,90,70,2,350,30.03,clear,"10% visible",
335202,,,,"Phalaenostola metonalis","Pale Phalaenostola Moth",Iowa,Linn,2023-06-17,22:09:14,"Wanatee County Park",42.010114365,-91.566550498333,"Jim Durbin",adult,Blacklight/Fluorescent,Photograph,1,75,54,57,2,90,29.84,c;ear,"no moon",
336107,,,,"Phalaenostola metonalis","Pale Phalaenostola Moth",Iowa,Linn,2023-06-29,21:54:12,"Indian Creek Nature Center",41.96608977,-91.58982624,"Jim Durbin",adult,Blacklight/Fluorescent,Photograph,1,76,92,74,0,330,29.88,hazy,"50% visible",
