ID,"Collection / Source","Catalog Number","Specify Number",Taxon,"Common Name",State,County,Date,Time,Locale,Latitude,Longitude,Collector,"Life Stage","Collection Method","Preparation Type",Count,Temperature,Humidity,"Dew Point",Wind,"Wind Direction","Barometric Pressure",Sky,"Moon Phase",Notes
11017,,2014-011299,SPM040351,"Xysticus fraternus",None,Iowa,Linn,2014-06-10,,"Pleasant Creek State Recreation Area, Linn County",42.10948,-91.8249,"Jim Durbin",adult,Blacklight/Fluorescent,Photograph,1,,,,,,,,,
16218,,2014-016516,SPM023114,"Mecaphesa asperata","Northern Crab Spider",Iowa,Linn,2011-07-16,,"Wanatee County Park",42.0094,-91.56623,"Jim Durbin",adult,Blacklight/Fluorescent,Photograph,1,,,,,,,,,
16222,,2014-016520,SPM023496,"Dolomedes scriptus","Fishing Spider",Iowa,Linn,2011-08-19,,"Wanatee County Park",42.0094,-91.56623,"Jim Durbin",adult,Blacklight/Fluorescent,Photograph,1,,,,,,,,,
16234,,2014-016532,SPM025702,"Rabidosa rabida","Rabid Wolf Spider",Iowa,Linn,2012-03-15,,"Wanatee County Park",42.01026,-91.57381,"Jim Durbin",adult,Blacklight/Fluorescent,Photograph,1,,,,,,,,,
16235,,2014-016533,SPM025703,"Larinioides sclopetarius","Gray Cross Spider",Iowa,Linn,2012-03-15,,"Wanatee County Park",42.01026,-91.57381,"Jim Durbin",adult,Blacklight/Fluorescent,Photograph,1,,,,,,,,,
16236,,2014-016534,SPM025708,"Cyclosa conica",None,Iowa,Linn,2012-03-15,,"Wanatee County Park",42.01026,-91.57381,"Jim Durbin",adult,Blacklight/Fluorescent,Photograph,1,,,,,,,,,
16237,,2014-016535,SPM026407,"Schizocosa crassipes",None,Iowa,Linn,2012-04-24,,"Matsell Bridge Natural Area",42.13131,-91.38886,"Jim Durbin",adult,Blacklight/Fluorescent,Photograph,1,,,,,,,,,
16238,,2014-016536,SPM026408,"Pisaurina mira","Nursery Web Spider",Iowa,Linn,2012-04-24,,"Matsell Bridge Natural Area",42.13131,-91.38886,"Jim Durbin",adult,Blacklight/Fluorescent,Photograph,1,,,,,,,,,
16239,,2014-016537,SPM026447,"Castianeira cingulata","Twobanded Antmimic",Iowa,Linn,2012-04-25,,"Matsell Bridge Natural Area",42.13131,-91.38886,"Jim Durbin",adult,Blacklight/Fluorescent,Photograph,1,,,,,,,,,
16240,,2014-016538,SPM026448,"Xysticus ferox",None,Iowa,Linn,2012-04-25,,"Matsell Bridge Natural Area",42.13131,-91.38886,"Jim Durbin",adult,Blacklight/Fluorescent,Photograph,1,,,,,,,,,
16247,"Jim Durbin Drawer 349",2014-016545,SPM034757,"Castianeira cingulata","Twobanded Antmimic",Iowa,Linn,2013-07-19,,"Pinicon Ridge Park",42.21028,-91.54417,"Jim Durbin",adult,Blacklight/Fluorescent,Pinned,1,,,,,,,,,
16254,,2014-016552,SPM035944,"Neoscona crucifera","Hentz's Orbweaver",Iowa,Linn,2013-08-11,,"Wanatee County Park",42.01026,-91.57381,"Jim Durbin",adult,Blacklight/Fluorescent,Photograph,1,,,,,,,,,
16255,,2014-016553,SPM035945,"Leucauge venusta","Orchard Spider",Iowa,Linn,2013-08-11,,"Wanatee County Park",42.01026,-91.57381,"Jim Durbin",adult,Blacklight/Fluorescent,Photograph,1,,,,,,,,,
16256,,2014-016554,SPM035972,"Xysticus funestus",None,Iowa,Linn,2013-08-11,,"Wanatee County Park",42.01026,-91.57381,"Jim Durbin",adult,Blacklight/Fluorescent,Photograph,1,,,,,,,,,
16257,,2014-016555,SPM036330,"Spider undetermined",None,Iowa,Linn,2013-08-24,,"Pinicon Ridge Park",42.21028,-91.54417,"Jim Durbin",adult,Blacklight/Fluorescent,Photograph,1,,,,,,,,,
16258,,2014-016556,SPM036393,"Tigrosa helluo",None,Iowa,Linn,2013-08-24,,"Pinicon Ridge Park",42.21028,-91.54417,"Jim Durbin",adult,Blacklight/Fluorescent,Photograph,1,,,,,,,,,
34856,,2014-035229,SPM023827,"Spider undetermined",None,Iowa,Linn,2011-09-02,,"Wanatee County Park",42.0094,-91.56623,"Jim Durbin",adult,Blacklight/Fluorescent,Photograph,1,,,,,,,,,
65553,,2014-066155,,"Spider undetermined",None,Iowa,Linn,2014-09-19,1930-2200DST,"Pleasant Creek State Recreation Area, Linn County",42.110327,-91.822988,"Jim Durbin",adult,Blacklight/Fluorescent,Photograph,1,70-67,68-75,59,12,180,29.86,,none,
65562,,2014-066164,,"Spider undetermined",None,Iowa,Linn,2014-09-19,1930-2200DST,"Pleasant Creek State Recreation Area, Linn County",42.110327,-91.822988,"Jim Durbin",adult,Blacklight/Fluorescent,Photograph,1,70-67,68-75,59,12,180,29.86,,none,
122539,,2015-013096,,"Hogna aspersa","Tiger Wolf Spider",Iowa,Linn,2015-04-26,"1100 to 1300","Rehrauer Natural Area",42.254081,-91.485914,"Jim Durbin",adult,Blacklight/Fluorescent,Photograph,1,58,35,31,2,45,30.01,Clear,"Waxing Crescent",
126692,,2015-017260,,"Larinioides cornutus","Furrow Orbweaver",Iowa,Linn,2015-06-08,2100-2315,"1460 Douglas Ct, Marion",42.040069,-91.590953,"Jim Durbin",adult,Blacklight/Fluorescent,Photograph,1,77,49,56,0,210,29.78,clear,"55% visible",
127097,,2015-017659,,"Spider undetermined",None,Iowa,Linn,2015-06-17,,"1460 Douglas Ct, Marion",42.040069,-91.590953,"Jim Durbin",adult,Blacklight/Fluorescent,Photograph,1,,,,,,,,,
127516,,2015-018106,,"Larinioides cornutus","Furrow Orbweaver",Iowa,Linn,2015-06-20,,"1460 Douglas Ct, Marion",42.040069,-91.590953,"Jim Durbin",adult,Blacklight/Fluorescent,Photograph,1,,,,,,,,,
130774,,2015-021364,,"Larinioides cornutus","Furrow Orbweaver",Iowa,Linn,2015-09-23,"1930 to 2200","1460 Douglas Ct, Marion",42.040069,-91.590953,"Jim Durbin",adult,Blacklight/Fluorescent,Photograph,1,72,75,58,0,145,30.13,"partly cloudy","85% visible",
167895,,2016-032640,,"Maevia inclemens",None,Iowa,Linn,2016-05-29,2030-2300,"Vecny Woods",41.956725,-91.600854,"Jim Durbin",adult,Blacklight/Fluorescent,Photograph,1,76,54,58,0,180,29.94,"partly cloudy","80% visible","Very damp with short shower."
169066,,2016-033811,,"Pisaurina mira","Nursery Web Spider",Iowa,Linn,2016-06-08,2048-2300,"Hitaga Sand Ridge Prairie Preserve",42.250957,-91.632098,"Jim Durbin",adult,Blacklight/Fluorescent,Photograph,1,75,48,53,0,120,29.88,cloudy,"10% visible",
169313,,2016-034058,,"Spider undetermined",None,Iowa,Linn,2016-06-11,2100-2315,"Vecny Woods",41.956725,-91.600854,"Jim Durbin",adult,Blacklight/Fluorescent,Photograph,1,84,67,72,0,0,29.92,cloudy,"45% visible",
169381,,2016-034126,,"Spider undetermined",None,Iowa,Linn,2016-06-15,2100-2315,"Hitaga Sand Ridge Prairie Preserve",42.250957,-91.632098,"Jim Durbin",adult,Blacklight/Fluorescent,Photograph,1,83,56,66,8,310,29.74,clear,"90% visible",
169578,,2016-034323,,"Spider undetermined",None,Iowa,Linn,2016-06-15,2100-2315,"Hitaga Sand Ridge Prairie Preserve",42.250957,-91.632098,"Jim Durbin",adult,Blacklight/Fluorescent,Photograph,1,83,56,66,8,310,29.74,clear,"90% visible",
170865,,2016-035610,,"Leucauge venusta","Orchard Spider",Iowa,Linn,2016-06-24,2045-2300,"Wanatee County Park",42.01026,-91.57381,"Jim Durbin",adult,Blacklight/Fluorescent,Photograph,1,77,69,66,3,100,29.95,clear,"45 % visible","45 % visible"
171025,,2016-035770,,"Spider undetermined",None,Iowa,Linn,2016-06-27,2100-2330,"Hitaga Sand Ridge Prairie Preserve",42.250957,-91.632098,"Jim Durbin",adult,Blacklight/Fluorescent,Photograph,1,77,59,62,4,300,30.06,"partly cloudy","50% visible",
171029,,2016-035774,,"Spider undetermined",None,Iowa,Linn,2016-06-27,2100-2330,"Hitaga Sand Ridge Prairie Preserve",42.250957,-91.632098,"Jim Durbin",adult,Blacklight/Fluorescent,Photograph,1,77,59,62,4,300,30.06,"partly cloudy","50% visible",
171054,,2016-035799,,"Spider undetermined",None,Iowa,Linn,2016-06-27,2100-2330,"Hitaga Sand Ridge Prairie Preserve",42.250957,-91.632098,"Jim Durbin",adult,Blacklight/Fluorescent,Photograph,1,77,59,62,4,300,30.06,"partly cloudy","50% visible",
171289,,2016-036034,,"Spider undetermined",None,Iowa,Linn,2016-06-27,2100-2330,"Hitaga Sand Ridge Prairie Preserve",42.250957,-91.632098,"Jim Durbin",adult,Blacklight/Fluorescent,Photograph,1,77,59,62,4,300,30.06,"partly cloudy","50% visible",
173581,,2016-038331,,"Zygoballus rufipes",None,Iowa,Linn,2016-08-03,2100-2330,"Hitaga Sand Ridge Prairie Preserve",42.250957,-91.632098,"Jim Durbin",adult,Blacklight/Fluorescent,Photograph,1,81,74,71,3,180,29.96,clear,Dark,
173920,,2016-038675,,"Araneus diadematus","Cross Orbweaver",Iowa,Linn,2016-08-09,2030-2300,"Hitaga Sand Ridge Prairie Preserve",42.250957,-91.632098,"Jim Durbin",adult,Blacklight/Fluorescent,Photograph,1,79,79,71,0,0,29.96,clear,"40% visible",
176074,,2016-040824,,"Misumena vatia","Goldenrod Crab Spider",Iowa,Linn,2016-08-31,,"Hitaga Sand Ridge Prairie Preserve",42.24944,-91.63056,"Jim Durbin",adult,Blacklight/Fluorescent,Photograph,1,,,,,,,,,
176078,,2016-040828,,"Misumena vatia","Goldenrod Crab Spider",Iowa,Linn,2016-08-31,,"Hitaga Sand Ridge Prairie Preserve",42.24944,-91.63056,"Jim Durbin",adult,Blacklight/Fluorescent,Photograph,1,,,,,,,,,
176079,,2016-040829,,"Misumena vatia","Goldenrod Crab Spider",Iowa,Linn,2016-08-31,,"Hitaga Sand Ridge Prairie Preserve",42.24944,-91.63056,"Jim Durbin",adult,Blacklight/Fluorescent,Photograph,1,,,,,,,,,
176089,,2016-040839,,"Argiope aurantia","Black & Yellow Argiope",Iowa,Linn,2016-08-31,,"Hitaga Sand Ridge Prairie Preserve",42.24944,-91.63056,"Jim Durbin",adult,Blacklight/Fluorescent,Photograph,1,,,,,,,,,
176097,,2016-040847,,"Phidippus princeps",None,Iowa,Linn,2016-08-31,,"Hitaga Sand Ridge Prairie Preserve",42.24944,-91.63056,"Jim Durbin",adult,Blacklight/Fluorescent,Photograph,1,,,,,,,,,
176106,,2016-040856,,"Misumenoides formosipes","Whitebanded Crab Spider",Iowa,Linn,2016-08-31,,"Hitaga Sand Ridge Prairie Preserve",42.24944,-91.63056,"Jim Durbin",adult,Blacklight/Fluorescent,Photograph,1,,,,,,,,,
176121,,2016-040871,,"Misumena vatia","Goldenrod Crab Spider",Iowa,Linn,2016-08-20,,"Pinicon Ridge Park",42.21028,-91.54417,"Don F. Becker",adult,,Photograph,1,,,,,,,,,
176134,,2016-040884,,"Misumena vatia","Goldenrod Crab Spider",Iowa,Linn,2016-08-20,,"Pinicon Ridge Park",42.21028,-91.54417,"Don F. Becker",adult,,Photograph,1,,,,,,,,,
176145,,2016-040895,,"Misumena vatia","Goldenrod Crab Spider",Iowa,Linn,2016-08-20,,"Pinicon Ridge Park",42.21028,-91.54417,"Don F. Becker",adult,,Photograph,1,,,,,,,,,
176148,,2016-040898,,"Misumena vatia","Goldenrod Crab Spider",Iowa,Linn,2016-08-20,,"Pinicon Ridge Park",42.21028,-91.54417,"Don F. Becker",adult,,Photograph,1,,,,,,,,,
177268,,2016-042018,,"Castianeira descripta","Redspotted Antmimic",Iowa,Linn,2016-08-08,,"Hitaga Sand Ridge Prairie Preserve",42.250957,-91.632098,"Don F. Becker",adult,,Photograph,1,,,,,,,,,
182358,,2017-000319,,"Alopecosa kochi",None,Iowa,Linn,2016-03-28,,"Behren's Pond Woodland State Preserve",42.118214,-91.754324,"Jim Durbin",adult,Blacklight/Fluorescent,Photograph,1,,,,,,,,,
182359,,2017-000320,,"Pisaurina mira","Nursery Web Spider",Iowa,Linn,2016-03-28,,"Behren's Pond Woodland State Preserve",42.118214,-91.754324,"Jim Durbin",adult,Blacklight/Fluorescent,Photograph,1,,,,,,,,,
182383,,2017-000344,,"Phidippus audax","Bold Jumper",Iowa,Linn,2016-06-12,,"Indian Creek Sac and Fox Trail, Rosedale Rd. SE",41.987927,-91.5793137,"Jim Durbin",adult,Blacklight/Fluorescent,Photograph,1,,,,,,,,,
183305,,2017-001266,,"Spider undetermined",None,Iowa,Linn,2016-06-23,,"Hitaga Sand Ridge Prairie Preserve",42.250957,-91.632098,"Jim Durbin",adult,Blacklight/Fluorescent,Photograph,1,,,,,,,,,
183353,,2017-001314,,"Misumena vatia","Goldenrod Crab Spider",Iowa,Linn,2016-08-26,,"Hitaga Sand Ridge Prairie Preserve",42.250957,-91.632098,"Jim Durbin",adult,Blacklight/Fluorescent,Photograph,1,,,,,,,,,
183356,,2017-001317,,"Misumena vatia","Goldenrod Crab Spider",Iowa,Linn,2016-08-26,,"Hitaga Sand Ridge Prairie Preserve",42.250957,-91.632098,"Jim Durbin",adult,Blacklight/Fluorescent,Photograph,1,,,,,,,,,
183366,,2017-001327,,"Argiope aurantia","Black & Yellow Argiope",Iowa,Linn,2016-08-26,,"Hitaga Sand Ridge Prairie Preserve",42.250957,-91.632098,"Jim Durbin",adult,Blacklight/Fluorescent,Photograph,1,,,,,,,,,
183374,,2017-001335,,"Phidippus princeps",None,Iowa,Linn,2016-08-26,,"Hitaga Sand Ridge Prairie Preserve",42.250957,-91.632098,"Jim Durbin",adult,Blacklight/Fluorescent,Photograph,1,,,,,,,,,
183384,,2017-001345,,"Misumenoides formosipes","Whitebanded Crab Spider",Iowa,Linn,2016-08-26,,"Hitaga Sand Ridge Prairie Preserve",42.250957,-91.632098,"Jim Durbin",adult,Blacklight/Fluorescent,Photograph,1,,,,,,,,,
185611,,2017-003573,,"Neoscona arabesca","Arabesque Orbweaver",Iowa,Linn,2007-08-30,,"Grant Wood Trail",42.0275,-91.54722,"Jim Durbin",adult,Blacklight/Fluorescent,Photograph,1,,,,,,,,,
185612,,2017-003574,,"Misumena vatia","Goldenrod Crab Spider",Iowa,Linn,2007-08-30,,"Grant Wood Trail",42.0275,-91.54722,"Jim Durbin",adult,Blacklight/Fluorescent,Photograph,1,,,,,,,,,
185613,,2017-003575,,"Argiope aurantia","Black & Yellow Argiope",Iowa,Linn,2007-08-30,,"Grant Wood Trail",42.0275,-91.54722,"Jim Durbin",adult,Blacklight/Fluorescent,Photograph,1,,,,,,,,,
185849,,2017-003811,,"Pisaurina mira","Nursery Web Spider",Iowa,Linn,2008-07-27,,"Matsell Bridge Natural Area",42.1380556,-91.4047222,"Jim Durbin",adult,Blacklight/Fluorescent,Photograph,1,,,,,,,,,
186081,,2017-004043,,"Ozyptila undetermined",None,Iowa,Linn,2008-10-04,,"1460 Douglas Ct, Marion",42.040069,-91.590953,"Jim Durbin",adult,Blacklight/Fluorescent,Photograph,1,,,,,,,,,
186750,,2017-004711,,"Spider undetermined",None,Iowa,Linn,2015-04-26,,"Rehrauer Natural Area",42.254081,-91.485914,"Jim Durbin",adult,Blacklight/Fluorescent,Photograph,1,,,,,,,,,
192550,,2017-010511,,"Araneus ventricosus",None,Iowa,Linn,2017-06-14,2100-2330,"Wickiup Hill Outdoor Learning Area",42.087567,-91.767578,"Jim Durbin",adult,Blacklight/Fluorescent,Photograph,1,80,73,71,3,120,29.75,cloudy,"90% visible",
192950,,2017-010915,,"Mimetus puritanus",None,Iowa,Linn,2017-07-01,,"Hitaga Sand Ridge Prairie Preserve",42.250957,-91.632098,"Jim Durbin",adult,Blacklight/Fluorescent,Photograph,1,72,56,55,280,9,29.97,clear,,
193358,,2017-011323,,"Neoscona crucifera","Hentz's Orbweaver",Iowa,Linn,2017-07-04,,"Wickiup Hill Outdoor Learning Area",42.087358,-91.767092,"Jim Durbin",adult,Blacklight/Fluorescent,Photograph,1,78,78,71,3,90,30.02,"partly cloudy","80% visible",
193858,,2017-011849,,"Leucauge venusta","Orchard Spider",Iowa,Linn,2017-07-13,,"1460 Douglas Ct, Marion",42.040069,-91.590953,"Jim Durbin",adult,Blacklight/Fluorescent,Photograph,1,,,,,,,,,
210237,,2018-008394,,"Pisaurina mira","Nursery Web Spider",Iowa,Linn,2018-05-16,"2030 to 2300","Wanatee County Park",42.01026,-91.57381,"Jim Durbin",adult,Blacklight/Fluorescent,Photograph,1,72,45,50,1,100,29.86,clear,"0 visible",
211779,,2018-009936,,"Araneus ventricosus",None,Iowa,Linn,2018-06-06,2030-2315,"Wickiup Hill Outdoor Learning Area",42.087352,-91.767107,"Jim Durbin",adult,Blacklight/Fluorescent,Photograph,1,74,69,64,5,280,29.83,cloudy,"50% visible",
218668,,2018-016824,,"Pisaurina mira","Nursery Web Spider",Iowa,Linn,2018-08-11,,"1460 Douglas Ct, Marion",42.040069,-91.590953,"Jim Durbin",adult,Blacklight/Fluorescent,Photograph,1,,,,,,,,,
230595,,2019-005829,,"Pisaurina mira","Nursery Web Spider",Iowa,Linn,2019-05-30,,"Hitaga Sand Ridge Prairie Preserve",42.250957,-91.632098,"Jim Durbin",adult,Blacklight/Fluorescent,Photograph,1,68,81,62,,,29.82,"partly cloidy","10% visible",
235106,,,,"Platycryptus undatus",None,Iowa,Linn,2019-07-08,9:30:00,"Mt Vernon",41.925348,-91.424558,"Daniel Klever",,,Photograph,1,,,,,,,,,"I'm pretty sure this is the correct species...
Found it sitting around on a wall next to our ped mall at Cornell College"
236747,,,,"Neoscona crucifera","Hentz's Orbweaver",Iowa,Linn,2019-08-25,15:18:01,Redacted,Redacted,Redacted,"james durbin II",adult,Sighting,Photograph,1,,,,,,,,,
237096,,,,"Neoscona crucifera","Hentz's Orbweaver",Iowa,Linn,2019-09-06,7:24:59,"1460 Douglas Ct, Marion",42.040069,-91.590953,"Jim Durbin",adult,Sighting,Photograph,1,,,,,,,,,
241703,,,,"Phlegra hentzi",None,Iowa,Linn,2019-06-14,,"Matsell Bridge Natural Area",42.13131,-91.38886,"Mark Brown",adult,Sighting,Photograph,1,,,,,,,,,
266994,,,,"Leucauge venusta","Orchard Spider",Iowa,Linn,2020-06-12,21:15:15,"Hitaga Sand Ridge Prairie Preserve",42.2508675,-91.63209427,"Jim Durbin",adult,Blacklight/Fluorescent,Photograph,1,76,48,55,0,0,30.17,"partly cloudy","80% visible",
266995,,,,"Pisaurina mira","Nursery Web Spider",Iowa,Linn,2020-06-12,21:14:16,"Hitaga Sand Ridge Prairie Preserve",42.2508675,-91.63209426,"Jim Durbin",,Blacklight/Fluorescent,Photograph,1,,,,,,,,,
269309,,,,"Pisaurina mira","Nursery Web Spider",Iowa,Linn,2020-06-21,10:47:34,"1460 Douglas Ct, Marion",42.040069,-91.590953,"Jim Durbin",adult,Sighting,Photograph,1,,,,,,,,,
269311,,,,"Misumena vatia","Goldenrod Crab Spider",Iowa,Linn,2020-06-21,11:46:31,"1460 Douglas Ct, Marion",42.040069,-91.590953,"Jim Durbin",adult,Sighting,Photograph,1,,,,,,,,,
274880,,,,"Mangora placida","Tuftlegged Orbweaver",Iowa,Linn,2020-06-06,,"Behren's Pond Woodland State Preserve",42.117103,-91.753394,"Mark Brown",adult,Sighting,Photograph,1,,,,,,,,,
277735,,,,"Oxyopes scalaris","Western Lynx Spiders",Iowa,Linn,2020-06-14,,"Hitaga Sand Ridge Prairie Preserve",42.2513,-91.632105,"Mark Brown",adult,Sighting,Photograph,1,,,,,,,,,
277755,,,,"Maevia inclemens",None,Iowa,Linn,2020-06-14,,"Hitaga Sand Ridge Prairie Preserve",42.250665,-91.635281,"Mark Brown",adult,Sighting,Photograph,1,,,,,,,,,
277776,,,,"Zygoballus rufipes",None,Iowa,Linn,2020-06-17,,"Hitaga Sand Ridge Prairie Preserve",42.249894,-91.630026,"Mark Brown",adult,Sighting,Photograph,1,,,,,,,,,
277785,,,,"Hypsosinga funebris",None,Iowa,Linn,2020-06-17,,"Hitaga Sand Ridge Prairie Preserve",42.249894,-91.630026,"Mark Brown",adult,Sighting,Photograph,1,,,,,,,,,
287771,,,,"Xysticus fraternus",None,Iowa,Linn,2021-05-18,17:16:38,"Cedar Rapids",41.994505,-91.736771,"Dodie Wendt",,,Photograph,1,,,,,,,,,"I vacuumed them up, there were 2.  If you would want them I can try to find them in the dirt."
288037,,,,"Pisaurina mira","Nursery Web Spider",Iowa,Linn,2021-05-30,11:36:21,"1460 Douglas Ct, Marion",42.040069,-91.590953,"Jim Durbin",adult,Sighting,Photograph,1,,,,,,,,,
288047,,,,"Tigrosa helluo",None,Iowa,Linn,2021-05-30,13:10:20,"1460 Douglas Ct, Marion",42.040069,-91.590953,"Jim Durbin",adult,Sighting,Photograph,1,,,,,,,,,
288312,,,,"Platycryptus undatus",None,Iowa,Linn,2021-06-15,,"Cedar Rapids",41.924045,-91.650095,"Jarrod Hocker",adult,Sighting,Photograph,1,,,,,,,,,
288335,,,,"Oxyopes scalaris","Western Lynx Spiders",Iowa,Linn,2021-06-14,12:10:52,"1460 Douglas Ct, Marion",42.040069,-91.590953,"Jim Durbin",adult,Sighting,Photograph,1,,,,,,,,,
297987,,,,"Micrathena gracilis","Spined Micrathena",Iowa,Linn,2021-07-24,,"Hitaga Sand Ridge Prairie Preserve",42.250856,-91.633802,"Mark Brown",adult,Sighting,Photograph,1,,,,,,,,,
297991,,,,"Micrathena mitrata","White Micrathena",Iowa,Linn,2021-07-24,,"Hitaga Sand Ridge Prairie Preserve",42.250856,-91.633802,"Mark Brown",adult,Sighting,Photograph,1,,,,,,,,,
297996,,,,"Hibana gracilis",None,Iowa,Linn,2021-07-24,,"Hitaga Sand Ridge Prairie Preserve",42.250856,-91.633802,"Mark Brown",adult,Sighting,Photograph,1,,,,,,,,,
298000,,,,"Maevia inclemens",None,Iowa,Linn,2021-07-24,,"Hitaga Sand Ridge Prairie Preserve",42.250856,-91.633802,"Mark Brown",adult,Sighting,Photograph,1,,,,,,,,,
309797,,,,"Schizocosa crassipes",None,Iowa,Linn,2022-06-07,14:34:02,"1460 Douglas Ct, Marion",42.040069,-91.590953,"Jim Durbin",adult,Sighting,Photograph,2,,,,,,,,,
309828,,,,"Platycryptus undatus",None,Iowa,Linn,2022-06-05,17:37:33,"1460 Douglas Ct, Marion",42.040069,-91.590953,"Jim Durbin",larva,Sighting,Photograph,10,,,,,,,,,
310100,,,,"Pisaurina mira","Nursery Web Spider",Iowa,Linn,2022-06-12,21:18:39,"Pinicon Ridge Park",42.21093766,-91.54432936,"Jim Durbin",adult,Sighting,Photograph,1,79,78,70,0,0,29.85,clear,full,
310265,,,,"Oxyopes scalaris","Western Lynx Spiders",Iowa,Linn,2022-06-06,17:11:04,"1460 Douglas Ct, Marion",42.040069,-91.590953,"Jim Durbin",adult,Sighting,Photograph,1,,,,0,0,,,,
310689,,,,"Enoplognatha ovata",None,Iowa,Linn,2022-06-25,14:31:15,"1460 Douglas Ct, Marion",42.040069,-91.590953,"Jim Durbin",adult,Sighting,Photograph,3,,,,,,,,,
310696,,,,"Mangora placida","Tuftlegged Orbweaver",Iowa,Linn,2022-06-25,14:22:39,"1460 Douglas Ct, Marion",42.040069,-91.590953,"Jim Durbin",adult,Sighting,Photograph,3,,,,,,,,,
310734,,,,"Enoplognatha ovata",None,Iowa,Linn,2022-06-25,13:24:10,"1460 Douglas Ct, Marion",42.040069,-91.590953,"Jim Durbin",adult,Sighting,Photograph,3,,,,,,,,,
311345,,,,"Agelenopsis potteri","Potter’s Grass Spider",Iowa,Linn,2022-06-27,14:30:47,"1460 Douglas Ct, Marion",42.040069,-91.590953,"Jim Durbin",adult,Sighting,Photograph,1,,,,,,,,,
311711,,,,"Rabidosa rabida","Rabid Wolf Spider",Iowa,Linn,2022-07-07,11:14:47,"1460 Douglas Ct, Marion",42.040069,-91.590953,"Jim Durbin",adult,Sighting,Photograph,1,,,,,,,,,
312022,,,,"Pisaurina mira","Nursery Web Spider",Iowa,Linn,2022-07-10,11:28:55,"1460 Douglas Ct, Marion",42.040069,-91.590953,"Jim Durbin",adult,Sighting,Photograph,1,,,,,,,,,
312249,,,,"Pisaurina mira","Nursery Web Spider",Iowa,Linn,2022-07-10,8:59:50,"1460 Douglas Ct, Marion",42.040069,-91.590953,"Jim Durbin",adult,Sighting,Photograph,1,,,,,,,,,
312514,,,,"Neoscona crucifera","Hentz's Orbweaver",Iowa,Linn,2022-07-25,8:22:46,"1460 Douglas Ct, Marion",42.040069,-91.590953,"Jim Durbin",adult,Sighting,Photograph,1,,,,,,,,,
312768,,,,"Scytodes thoracica",None,Iowa,Linn,2022-08-01,19:23:28,"1460 Douglas Ct, Marion",42.040069,-91.590953,"Jim Durbin",,,Photograph,1,,,,,,,,,
312769,,,,"Neoscona crucifera","Hentz's Orbweaver",Iowa,Linn,2022-08-01,19:23:55,"1460 Douglas Ct, Marion",42.040069,-91.590953,"Jim Durbin",,,Photograph,1,,,,,,,,,
312967,,,,"Pisaurina mira","Nursery Web Spider",Iowa,Linn,2022-08-05,14:18:11,"1460 Douglas Ct, Marion",42.040069,-91.590953,"Jim Durbin",adult,Sighting,Photograph,1,,,,,,,,,
312968,,,,"Herpyllus ecclesiasticus","Eastern Parson Spider",Iowa,Linn,2022-08-07,9:58:13,"1460 Douglas Ct, Marion",42.040069,-91.590953,"Jim Durbin",adult,Sighting,Photograph,1,,,,,,,,,
313006,,,,"Tetragnatha elongata",None,Iowa,Linn,2022-07-31,8:42:40,"1460 Douglas Ct, Marion",42.040069,-91.590953,"Jim Durbin",adult,Sighting,Photograph,1,,,,,,,,,
313083,,,,"Herpyllus ecclesiasticus","Eastern Parson Spider",Iowa,Linn,2022-08-10,22:14:25,"Matsell Bridge Natural Area",42.13198835,-91.38532446,"Jim Durbin",adult,Blacklight/Fluorescent,Photograph,1,68,100,69,0,0,30.15,clear,full,
313706,,,,"Leucauge venusta","Orchard Spider",Iowa,Linn,2022-08-28,8:42:12,"1460 Douglas Ct, Marion",42.040069,-91.590953,"Jim Durbin",adult,Sighting,Photograph,1,,,,,,,,,
314995,,,,"Neoscona crucifera","Hentz's Orbweaver",Iowa,Linn,2022-09-20,16:43:53,"1460 Douglas Ct, Marion",42.040069,-91.590953,"Jim Durbin",adult,Sighting,Photograph,1,,,,,,,,,
316184,,,,"Dysdera crocata","Woodlouse Hunter",Iowa,Linn,2022-10-31,20:03:18,"Mosswood Ln NE-x",42.04343342,-91.66380963,"Don F. Becker",adult,Sighting,Photograph,1,,,,,,,,,"Seems to be drinking water off my cup"
320623,,,,"Phidippus audax","Bold Jumper",Iowa,Linn,2022-12-20,11:37:24,"Mt Vernon",41.921133,-91.421314,"Will Billmeyer ",adult,Sighting,Photograph,1,,,,,,,,,"In residence "
320928,,,,"Pisaurina mira","Nursery Web Spider",Iowa,Linn,2022-09-07,10:15:33,"1460 Douglas Ct, Marion",42.040069,-91.590953,"Jim Durbin",adult,Sighting,Photograph,1,,,,,,,,,
321062,,,,"Pisaurina mira","Nursery Web Spider",Iowa,Linn,2022-09-11,14:39:07,"1460 Douglas Ct, Marion",42.040069,-91.590953,"Jim Durbin",adult,Sighting,Photograph,1,,,,,,,,,
332879,,,,"Misumenoides formosipes","Whitebanded Crab Spider",Iowa,Linn,2022-08-13,12:38:51,"Hitaga Sand Ridge Prairie Preserve",42.25056046666667,-91.633314525,"Mark Brown",adult,Sighting,Photograph,1,,,,,,,,,
333460,,,,"Pisaurina mira","Nursery Web Spider",Iowa,Linn,2022-10-01,14:49:52,"Hitaga Sand Ridge Prairie Preserve",42.25054811333333,-91.63354681666667,"Mark Brown",adult,Sighting,Photograph,1,,,,,,,,,
333463,,,,"Phidippus princeps",None,Iowa,Linn,2022-10-01,16:04:58,"Hitaga Sand Ridge Prairie Preserve",42.25054811333333,-91.63354681666667,"Mark Brown",adult,Sighting,Photograph,1,,,,,,,,,
333489,,,,"Agelenopsis pennsylvanica","Pennsylvania Funnelweb Spider",Iowa,Linn,2022-08-12,17:53:27,"1460 Douglas Ct, Marion",42.040069,-91.590953,"Jim Durbin",adult,Sighting,Photograph,1,,,,,,,,,