ID,"Collection / Source","Catalog Number","Specify Number",Taxon,"Common Name",State,County,Date,Time,Locale,Latitude,Longitude,Collector,"Life Stage","Collection Method","Preparation Type",Count,Temperature,Humidity,"Dew Point",Wind,"Wind Direction","Barometric Pressure",Sky,"Moon Phase",Notes
13257,"Jim Durbin Drawer 145",2014-013539,SPM006930,"Acronicta afflicta","Afflicted Dagger Moth",Iowa,Linn,2006-07-28,,"Pleasant Creek State Recreation Area, Linn County",42.11952,-91.81215,"Jim Durbin",adult,Blacklight/Fluorescent,Pinned,1,,,,,,,,,
13258,"Jim Durbin Drawer 145",2014-013540,SPM011976,"Acronicta afflicta","Afflicted Dagger Moth",Iowa,Linn,2008-08-10,,Redacted,Redacted,Redacted,"Jim Durbin",adult,Blacklight/Fluorescent,Pinned,1,,,,,,,,,
13260,"Frank Olsen Drawer 30",2014-013542,SPM024593,"Acronicta afflicta","Afflicted Dagger Moth",Iowa,Linn,2011-08-15,,"Matsell Bridge Natural Area",42.13131,-91.38886,"Frank Olsen",adult,,Pinned,1,,,,,,,,,"Located at Iowa State"
13261,"Frank Olsen Drawer 30",2014-013543,SPM024622,"Acronicta afflicta","Afflicted Dagger Moth",Iowa,Linn,2004-05-06,,"Wickiup Hill Outdoor Learning Area",42.08398,-91.7651,"Frank Olsen",adult,,Pinned,1,,,,,,,,,"Located at Iowa State"
13262,"Jim Durbin Drawer 145",2014-013544,SPM027097,"Acronicta afflicta","Afflicted Dagger Moth",Iowa,Linn,2012-05-18,,"Matsell Bridge Natural Area",42.13131,-91.38886,"Jim Durbin",adult,Blacklight/Fluorescent,Pinned,1,,,,,,,,,
13263,,2014-013545,SPM027224,"Acronicta afflicta","Afflicted Dagger Moth",Iowa,Linn,2012-05-18,,"Matsell Bridge Natural Area",42.13131,-91.38886,"Jim Durbin",adult,Blacklight/Fluorescent,Photograph,1,,,,,,,,,
109066,"Frank Olsen Drawer 30",2014-109456,,"Acronicta afflicta","Afflicted Dagger Moth",Iowa,Linn,2014-08-13,,"Pleasant Creek State Recreation Area, Linn County",42.110327,-91.822988,"Frank Olsen",adult,,Pinned,1,,,,,,,,,"Located at Iowa State"
133186,"Frank Olsen Drawer 30",2015-023780,,"Acronicta afflicta","Afflicted Dagger Moth",Iowa,Linn,2015-06-03,,"Matsell Bridge Natural Area",42.131959,-91.388307,"Frank Olsen",adult,,Pinned,1,,,,,,,,,"Located at Iowa State"
192648,,2017-010609,,"Acronicta afflicta","Afflicted Dagger Moth",Iowa,Linn,2017-06-14,2100-2330,"Wickiup Hill Outdoor Learning Area",42.087567,-91.767578,"Jim Durbin",adult,Blacklight/Fluorescent,Photograph,1,80,73,71,3,120,29.75,cloudy,"90% visible",
