ID,"Collection / Source","Catalog Number","Specify Number",Taxon,"Common Name",State,County,Date,Time,Locale,Latitude,Longitude,Collector,"Life Stage","Collection Method","Preparation Type",Count,Temperature,Humidity,"Dew Point",Wind,"Wind Direction","Barometric Pressure",Sky,"Moon Phase",Notes
186737,,2017-004698,,"Dicentra cucullaria","Dutchman's Breeches",Iowa,Linn,2015-04-14,,"Pleasant Creek State Recreation Area, Linn County",42.109952,-91.822641,"Jim Durbin",adult,Blacklight/Fluorescent,Photograph,1,,,,,,,,,
186741,,2017-004702,,"Dicentra cucullaria","Dutchman's Breeches",Iowa,Linn,2015-04-17,,"Hanging Bog State Preserve",42.03269,-91.76727,"Jim Durbin",adult,Blacklight/Fluorescent,Photograph,1,,,,,,,,,
188366,,2017-006327,,"Dicentra cucullaria","Dutchman's Breeches",Iowa,Linn,2012-04-01,,"Pleasant Creek State Recreation Area, Linn County",42.1097222,-91.8275,"Jim Durbin",adult,Blacklight/Fluorescent,Photograph,1,,,,,,,,,
214071,,2018-012227,,"Dicentra cucullaria","Dutchman's Breeches",Iowa,Linn,2018-04-29,,"1460 Douglas Ct, Marion",42.040069,-91.590953,"Jim Durbin",adult,Blacklight/Fluorescent,Photograph,1,,,,,,,,,
229196,,2019-003910,,"Dicentra cucullaria","Dutchman's Breeches",Iowa,Linn,2018-05-03,,"1460 Douglas Ct, Marion",42.040069,-91.590953,"Jim Durbin",adult,Blacklight/Fluorescent,Photograph,1,,,,,,,,,
235828,,,,"Dicentra cucullaria","Dutchman's Breeches",Iowa,Linn,2019-04-17,,"1460 Douglas Ct, Marion",42.040069,-91.590953,"Jim Durbin",adult,Sighting,Photograph,1,,,,,,,,,
235837,,,,"Dicentra cucullaria","Dutchman's Breeches",Iowa,Linn,2019-04-17,,"1460 Douglas Ct, Marion",42.040069,-91.590953,"Jim Durbin",adult,Sighting,Photograph,1,,,,,,,,,
263842,,,,"Dicentra cucullaria","Dutchman's Breeches",Iowa,Linn,2020-04-08,8:26:19,"1460 Douglas Ct, Marion",42.040069,-91.590953,"Jim Durbin",adult,Sighting,Photograph,1,,,,,,,,,
264131,,,,"Dicentra cucullaria","Dutchman's Breeches",Iowa,Linn,2020-04-22,14:13:05,"1460 Douglas Ct, Marion",42.040069,-91.590953,"Jim Durbin",adult,Sighting,Photograph,1,,,,,,,,,
264202,,,,"Dicentra cucullaria","Dutchman's Breeches",Iowa,Linn,2020-04-27,16:20:35,"1460 Douglas Ct, Marion",42.040069,-91.590953,"Jim Durbin",adult,Sighting,Photograph,1,,,,,,,,,
287322,,,,"Dicentra cucullaria","Dutchman's Breeches",Iowa,Linn,2021-04-05,12:59:33,"1460 Douglas Ct, Marion",42.040069,-91.590953,"Jim Durbin",,Sighting,Photograph,1,,,,,,,,,
287458,,,,"Dicentra cucullaria","Dutchman's Breeches",Iowa,Linn,2021-04-22,12:17:27,"1460 Douglas Ct, Marion",42.040069,-91.590953,"Jim Durbin",adult,Sighting,Photograph,1,,,,,,,,,
287463,,,,"Dicentra cucullaria","Dutchman's Breeches",Iowa,Linn,2021-04-17,17:05:50,"1460 Douglas Ct, Marion",42.040069,-91.590953,"Jim Durbin",adult,Sighting,Photograph,1,,,,,,,,,
309449,,,,"Dicentra cucullaria","Dutchman's Breeches",Iowa,Linn,2022-04-30,8:57:44,"1460 Douglas Ct, Marion",42.040069,-91.590953,"Jim Durbin",,Sighting,Photograph,1,,,,,,,,,
