ID,"Collection / Source","Catalog Number","Specify Number",Taxon,"Common Name",State,County,Date,Time,Locale,Latitude,Longitude,Collector,"Life Stage","Collection Method","Preparation Type",Count,Temperature,Humidity,"Dew Point",Wind,"Wind Direction","Barometric Pressure",Sky,"Moon Phase",Notes
495,"Frank Olsen Drawer 08",2014-000495,SPM010815,"Agnorisma badinodis","Pale-banded Dart",Iowa,Linn,2007-04-29,,"Pleasant Creek State Recreation Area, Linn County",42.11952,-91.81215,"Frank Olsen",adult,,Pinned,1,,,,,,,,,"Located at Iowa State"
14089,,2014-014374,SPM000366,"Agnorisma badinodis","Pale-banded Dart",Iowa,Linn,2003-08-29,,"Behren's Pond Woodland State Preserve",42.118214,-91.754324,"Jim Durbin",adult,Blacklight/Fluorescent,Sighting,1,,,,,,,,,
14090,"Frank Olsen Drawer 08",2014-014375,SPM002575,"Agnorisma badinodis","Pale-banded Dart",Iowa,Linn,2004-10-21,,"Wickiup Hill Outdoor Learning Area",42.08398,-91.7651,"Frank Olsen",adult,,Pinned,1,,,,,,,,,"Located at Iowa State"
14091,"Frank Olsen Drawer 08",2014-014376,SPM002576,"Agnorisma badinodis","Pale-banded Dart",Iowa,Linn,2004-09-27,,"Wickiup Hill Outdoor Learning Area",42.08398,-91.7651,"Frank Olsen",adult,,Pinned,1,,,,,,,,,"Located at Iowa State"
14092,"Frank Olsen Drawer 08",2014-014377,SPM002577,"Agnorisma badinodis","Pale-banded Dart",Iowa,Linn,2004-09-27,,"Wickiup Hill Outdoor Learning Area",42.08398,-91.7651,"Frank Olsen",adult,,Pinned,1,,,,,,,,,"Located at Iowa State"
14093,"Frank Olsen Drawer 08",2014-014378,SPM002578,"Agnorisma badinodis","Pale-banded Dart",Iowa,Linn,2004-09-20,,"Wickiup Hill Outdoor Learning Area",42.08398,-91.7651,"Frank Olsen",adult,,Pinned,1,,,,,,,,,"Located at Iowa State"
14094,"Frank Olsen Drawer 08",2014-014379,SPM002579,"Agnorisma badinodis","Pale-banded Dart",Iowa,Linn,2003-09-23,,"Wanatee County Park",42.00994,-91.57749,"Frank Olsen",adult,,Pinned,1,,,,,,,,,"Located at Iowa State"
14095,"Frank Olsen Drawer 08",2014-014380,SPM003321,"Agnorisma badinodis","Pale-banded Dart",Iowa,Linn,2004-09-18,,"Wickiup Hill Outdoor Learning Area",42.08398,-91.7651,"Frank Olsen",adult,,Pinned,1,,,,,,,,,"Located at Iowa State"
14096,"Frank Olsen Drawer 08",2014-014381,SPM003322,"Agnorisma badinodis","Pale-banded Dart",Iowa,Linn,2004-09-18,,"Wickiup Hill Outdoor Learning Area",42.08398,-91.7651,"Frank Olsen",adult,,Pinned,1,,,,,,,,,"Located at Iowa State"
14097,"Frank Olsen Drawer 08",2014-014382,SPM003323,"Agnorisma badinodis","Pale-banded Dart",Iowa,Linn,2003-10-06,,"Wanatee County Park",42.00994,-91.57749,"Frank Olsen",adult,,Pinned,1,,,,,,,,,"Located at Iowa State"
14099,"Jim Durbin Drawer 171",2014-014384,SPM007278,"Agnorisma badinodis","Pale-banded Dart",Iowa,Linn,2006-09-27,,"Wickiup Hill Outdoor Learning Area",42.08398,-91.7651,"Jim Durbin",adult,Blacklight/Fluorescent,Pinned,1,,,,,,,,,
14100,"Jim Durbin Drawer 171",2014-014385,SPM007280,"Agnorisma badinodis","Pale-banded Dart",Iowa,Linn,2006-09-27,,"Wickiup Hill Outdoor Learning Area",42.08398,-91.7651,"Jim Durbin",adult,Blacklight/Fluorescent,Pinned,1,,,,,,,,,
14101,"Frank Olsen Drawer 08",2014-014386,SPM008369,"Agnorisma badinodis","Pale-banded Dart",Iowa,Linn,2006-10-08,,"Rock Island Botanical State Preserve",42.02732,-91.72723,"Frank Olsen",adult,,Pinned,1,,,,,,,,,"Located at Iowa State"
14102,"Frank Olsen Drawer 08",2014-014387,SPM008370,"Agnorisma badinodis","Pale-banded Dart",Iowa,Linn,2006-10-08,,"Rock Island Botanical State Preserve",42.02732,-91.72723,"Frank Olsen",adult,,Pinned,1,,,,,,,,,"Located at Iowa State"
14105,"Jim Durbin Drawer 171",2014-014390,SPM009959,"Agnorisma badinodis","Pale-banded Dart",Iowa,Linn,2007-09-23,,"1460 Douglas Ct, Marion",42.040069,-91.590953,"Jim Durbin",adult,Blacklight/Fluorescent,Pinned,1,,,,,,,,,
14108,"Jim Durbin Drawer 171",2014-014393,SPM012607,"Agnorisma badinodis","Pale-banded Dart",Iowa,Linn,2008-09-25,,"Behren's Pond Woodland State Preserve",42.118214,-91.754324,"Jim Durbin",adult,Blacklight/Fluorescent,Pinned,1,,,,,,,,,
14109,"Jim Durbin Drawer 171",2014-014394,SPM019751,"Agnorisma badinodis","Pale-banded Dart",Iowa,Linn,2010-09-21,,"1460 Douglas Ct, Marion",42.040069,-91.590953,"Jim Durbin",adult,Blacklight/Fluorescent,Pinned,1,,,,,,,,,
14110,"Jim Durbin Drawer 171",2014-014395,SPM019832,"Agnorisma badinodis","Pale-banded Dart",Iowa,Linn,2010-10-09,,"Rock Island Botanical State Preserve",42.02732,-91.72723,"Tom Jantscher",adult,Blacklight/Fluorescent,Pinned,1,,,,,,,,,
14112,"Jim Durbin Drawer 171",2014-014397,SPM024029,"Agnorisma badinodis","Pale-banded Dart",Iowa,Linn,2011-09-28,,"Novak Elementary School",42.04972,-91.60472,"Jim Durbin",adult,Blacklight/Fluorescent,Pinned,1,,,,,,,,,
14113,"Jim Durbin Drawer 171",2014-014398,SPM024030,"Agnorisma badinodis","Pale-banded Dart",Iowa,Linn,2011-09-28,,"Novak Elementary School",42.04972,-91.60472,"Jim Durbin",adult,Blacklight/Fluorescent,Pinned,1,,,,,,,,,
14114,"Jim Durbin Drawer 171",2014-014399,SPM024031,"Agnorisma badinodis","Pale-banded Dart",Iowa,Linn,2011-09-28,,"Novak Elementary School",42.04972,-91.60472,"Jim Durbin",adult,Blacklight/Fluorescent,Pinned,1,,,,,,,,,
14115,"Jim Durbin Drawer 171",2014-014400,SPM024151,"Agnorisma badinodis","Pale-banded Dart",Iowa,Linn,2011-10-05,,"Wickiup Hill Outdoor Learning Area",42.08398,-91.7651,"Jim Durbin",adult,Blacklight/Fluorescent,Pinned,1,,,,,,,,,
14116,,2014-014401,SPM024175,"Agnorisma badinodis","Pale-banded Dart",Iowa,Linn,2011-10-05,,"Wickiup Hill Outdoor Learning Area",42.08398,-91.7651,"Jim Durbin",adult,Blacklight/Fluorescent,Photograph,1,,,,,,,,,
14117,,2014-014402,SPM024194,"Agnorisma badinodis","Pale-banded Dart",Iowa,Linn,2011-10-05,,"Wickiup Hill Outdoor Learning Area",42.08398,-91.7651,"Jim Durbin",adult,Blacklight/Fluorescent,Photograph,1,,,,,,,,,
14118,,2014-014403,SPM024203,"Agnorisma badinodis","Pale-banded Dart",Iowa,Linn,2011-10-05,,"Wickiup Hill Outdoor Learning Area",42.08398,-91.7651,"Jim Durbin",adult,Blacklight/Fluorescent,Photograph,1,,,,,,,,,
14119,,2014-014404,SPM024216,"Agnorisma badinodis","Pale-banded Dart",Iowa,Linn,2011-10-05,,"Wickiup Hill Outdoor Learning Area",42.08398,-91.7651,"Jim Durbin",adult,Blacklight/Fluorescent,Photograph,1,,,,,,,,,
14120,,2014-014405,SPM024221,"Agnorisma badinodis","Pale-banded Dart",Iowa,Linn,2011-10-05,,"Wickiup Hill Outdoor Learning Area",42.08398,-91.7651,"Jim Durbin",adult,Blacklight/Fluorescent,Photograph,1,,,,,,,,,
14121,,2014-014406,SPM024224,"Agnorisma badinodis","Pale-banded Dart",Iowa,Linn,2011-10-05,,"Wickiup Hill Outdoor Learning Area",42.08398,-91.7651,"Jim Durbin",adult,Blacklight/Fluorescent,Photograph,1,,,,,,,,,
14125,"Frank Olsen Drawer 08",2014-014410,SPM024738,"Agnorisma badinodis","Pale-banded Dart",Iowa,Linn,2011-10-06,,"J. Harold Ennis County Park",41.898488,-91.483092,"Frank Olsen",adult,,Pinned,1,,,,,,,,,"Located at Iowa State"
14126,"Frank Olsen Drawer 08",2014-014411,SPM024739,"Agnorisma badinodis","Pale-banded Dart",Iowa,Linn,2011-10-02,,"Matsell Bridge Natural Area",42.13131,-91.38886,"Frank Olsen",adult,,Pinned,1,,,,,,,,,"Located at Iowa State"
14128,"Frank Olsen Drawer 08",2014-014413,SPM024741,"Agnorisma badinodis","Pale-banded Dart",Iowa,Linn,2011-10-05,,"Wickiup Hill Outdoor Learning Area",42.08398,-91.7651,"Frank Olsen",adult,,Pinned,1,,,,,,,,,"Located at Iowa State"
14129,"Frank Olsen Drawer 08",2014-014414,SPM025095,"Agnorisma badinodis","Pale-banded Dart",Iowa,Linn,2007-09-29,,"J. Harold Ennis County Park",41.898488,-91.483092,"Frank Olsen",adult,,Pinned,1,,,,,,,,,"Located at Iowa State"
14133,"Frank Olsen Drawer 08",2014-014418,SPM036744,"Agnorisma badinodis","Pale-banded Dart",Iowa,Linn,2013-10-01,,"Wickiup Hill Outdoor Learning Area",42.08398,-91.7651,"Frank Olsen",adult,,Pinned,1,,,,,,,,,"Located at Iowa State"
14135,"Frank Olsen Drawer 08",2014-014420,SPM037402,"Agnorisma badinodis","Pale-banded Dart",Iowa,Linn,2013-09-25,,"Matsell Bridge Natural Area",42.13131,-91.38886,"Frank Olsen",adult,,Pinned,1,,,,,,,,,"Located at Iowa State"
14136,"Frank Olsen Drawer 08",2014-014421,SPM037404,"Agnorisma badinodis","Pale-banded Dart",Iowa,Linn,2013-09-24,,"Wickiup Hill Outdoor Learning Area",42.08398,-91.7651,"Frank Olsen",adult,,Pinned,1,,,,,,,,,"Located at Iowa State"
14137,"Frank Olsen Drawer 08",2014-014422,SPM037405,"Agnorisma badinodis","Pale-banded Dart",Iowa,Linn,2013-09-24,,"Wickiup Hill Outdoor Learning Area",42.08398,-91.7651,"Frank Olsen",adult,,Pinned,1,,,,,,,,,"Located at Iowa State"
14138,"Frank Olsen Drawer 08",2014-014423,SPM037406,"Agnorisma badinodis","Pale-banded Dart",Iowa,Linn,2013-09-24,,"Wickiup Hill Outdoor Learning Area",42.08398,-91.7651,"Frank Olsen",adult,,Pinned,1,,,,,,,,,"Located at Iowa State"
43825,"Jim Durbin Drawer 171",2014-044202,SPM019830,"Agnorisma badinodis","Pale-banded Dart",Iowa,Linn,2010-10-09,,"Rock Island Botanical State Preserve",42.02732,-91.72723,"Tom Jantscher",adult,Blacklight/Fluorescent,Pinned,1,,,,,,,,,
65503,,2014-066105,,"Agnorisma badinodis","Pale-banded Dart",Iowa,Linn,2014-09-19,1930-2200DST,"Pleasant Creek State Recreation Area, Linn County",42.110327,-91.822988,"Jim Durbin",adult,Blacklight/Fluorescent,Photograph,1,70-67,68-75,59,12,180,29.86,,none,
65511,"Jim Durbin Drawer 171",2014-066113,,"Agnorisma badinodis","Pale-banded Dart",Iowa,Linn,2014-09-19,1930-2200DST,"Pleasant Creek State Recreation Area, Linn County",42.110327,-91.822988,"Jim Durbin",adult,Blacklight/Fluorescent,Pinned,1,70-67,68-75,59,12,180,29.86,,none,
109090,"Frank Olsen Drawer 08",2014-109480,,"Agnorisma badinodis","Pale-banded Dart",Iowa,Linn,2014-09-18,,"Pleasant Creek State Recreation Area, Linn County",42.110327,-91.822988,"Frank Olsen",adult,,Pinned,1,,,,,,,,,"Located at Iowa State"
238592,,,,"Agnorisma badinodis","Pale-banded Dart",Iowa,Linn,2019-09-30,1915-2200,"Hitaga Sand Ridge Prairie Preserve",42.250957,-91.632098,"Jim Durbin",adult,Blacklight/Fluorescent,Photograph,1,81,67,69,13,185,29.64,Clear,"0% visible",
238610,,,,"Agnorisma badinodis","Pale-banded Dart",Iowa,Linn,2019-09-30,1915-2200,"Hitaga Sand Ridge Prairie Preserve",42.250957,-91.632098,"Jim Durbin",adult,Blacklight/Fluorescent,Photograph,1,81,67,69,13,185,29.64,Clear,"0% visible",
238614,,,,"Agnorisma badinodis","Pale-banded Dart",Iowa,Linn,2019-09-30,1915-2200,"Hitaga Sand Ridge Prairie Preserve",42.250957,-91.632098,"Jim Durbin",adult,Blacklight/Fluorescent,Photograph,1,81,67,69,13,185,29.64,Clear,"0% visible",
238621,,,,"Agnorisma badinodis","Pale-banded Dart",Iowa,Linn,2019-09-30,1915-2200,"Hitaga Sand Ridge Prairie Preserve",42.250957,-91.632098,"Jim Durbin",adult,Blacklight/Fluorescent,Photograph,1,81,67,69,13,185,29.64,Clear,"0% visible",
238632,,,,"Agnorisma badinodis","Pale-banded Dart",Iowa,Linn,2019-09-30,1915-2200,"Hitaga Sand Ridge Prairie Preserve",42.250957,-91.632098,"Jim Durbin",adult,Blacklight/Fluorescent,Photograph,1,81,67,69,13,185,29.64,Clear,"0% visible",
238634,,,,"Agnorisma badinodis","Pale-banded Dart",Iowa,Linn,2019-09-30,1915-2200,"Hitaga Sand Ridge Prairie Preserve",42.250957,-91.632098,"Jim Durbin",adult,Blacklight/Fluorescent,Photograph,1,81,67,69,13,185,29.64,Clear,"0% visible",
247397,,,,"Agnorisma badinodis","Pale-banded Dart",Iowa,Linn,2008-09-25,,"Behren's Pond Woodland State Preserve",42.118214,-91.754324,"Jim Durbin",adult,Blacklight/Fluorescent,Photograph,1,,,,,,,,,
310010,,,SPM012605,"Agnorisma badinodis","Pale-banded Dart",Iowa,Linn,2008-09-25,,"Behren's Pond Woodland State Preserve",42.118214,-91.754324,"Jim Durbin",adult,Blacklight/Fluorescent,Photograph,1,,,,,,,,,
341779,,,,"Agnorisma badinodis","Pale-banded Dart",Iowa,Linn,2023-09-29,20:41:53,"Hitaga Sand Ridge Prairie Preserve",42.250745948333,-91.632190941667,"Jim Durbin",adult,Blacklight/Fluorescent,Photograph,1,78,75,65,9,160,30.03,clear,,
