ID,"Collection / Source","Catalog Number","Specify Number",Taxon,"Common Name",State,County,Date,Time,Locale,Latitude,Longitude,Collector,"Life Stage","Collection Method","Preparation Type",Count,Temperature,Humidity,"Dew Point",Wind,"Wind Direction","Barometric Pressure",Sky,"Moon Phase",Notes
17936,"Jim Durbin Drawer 057",2014-018236,SPM027305,"Lomographa vestaliata","White Spring Moth",Iowa,Linn,2012-05-21,,"Matsell Bridge Natural Area",42.13131,-91.38886,"Jim Durbin",adult,Blacklight/Fluorescent,Pinned,1,,,,,,,,,
17945,"Frank Olsen Drawer 45",2014-018245,SPM020481,"Lomographa vestaliata","White Spring Moth",Iowa,Linn,2010-05-14,,"Pleasant Creek State Recreation Area, Linn County",42.11952,-91.81215,"Frank Olsen",adult,,Pinned,1,,,,,,,,,"Located at Iowa State"
27462,,2014-027815,SPM028934,"Lomographa vestaliata","White Spring Moth",Iowa,Linn,2012-06-17,,"Wanatee County Park",42.01026,-91.57381,"Jim Durbin",adult,Blacklight/Fluorescent,Photograph,1,,,,,,,,,
34576,"Frank Olsen Drawer 45",2014-034949,SPM002312,"Lomographa vestaliata","White Spring Moth",Iowa,Linn,2003-05-25,,"Wanatee County Park",42.00994,-91.57749,"Frank Olsen",adult,,Pinned,1,,,,,,,,,"Located at Iowa State"
34577,"Frank Olsen Drawer 45",2014-034950,SPM002313,"Lomographa vestaliata","White Spring Moth",Iowa,Linn,2004-05-19,,"Wickiup Hill Outdoor Learning Area",42.08398,-91.7651,"Frank Olsen",adult,,Pinned,1,,,,,,,,,"Located at Iowa State"
34578,"Frank Olsen Drawer 45",2014-034951,SPM002314,"Lomographa vestaliata","White Spring Moth",Iowa,Linn,2004-06-03,,"Wickiup Hill Outdoor Learning Area",42.08398,-91.7651,"Frank Olsen",adult,,Pinned,1,,,,,,,,,"Located at Iowa State"
34591,"Jim Durbin Drawer 057",2014-034964,SPM022109,"Lomographa vestaliata","White Spring Moth",Iowa,Linn,2011-06-14,,"Wickiup Hill Outdoor Learning Area",42.08398,-91.7651,"Jim Durbin",adult,Blacklight/Fluorescent,Pinned,1,,,,,,,,,
34592,"Frank Olsen Drawer 45",2014-034965,SPM024892,"Lomographa vestaliata","White Spring Moth",Iowa,Linn,2011-05-30,,"Rock Island Botanical State Preserve",42.02732,-91.72723,"Frank Olsen",adult,,Pinned,1,,,,,,,,,"Located at Iowa State"
34595,,2014-034968,SPM026878,"Lomographa vestaliata","White Spring Moth",Iowa,Linn,2012-05-06,,"Matsell Bridge Natural Area",42.13131,-91.38886,"Jim Durbin",adult,Blacklight/Fluorescent,Photograph,1,,,,,,,,,
34596,,2014-034969,SPM026941,"Lomographa vestaliata","White Spring Moth",Iowa,Linn,2012-05-10,,"Wakpicada Natural Area",42.18892,-91.52035,"Jim Durbin",adult,Blacklight/Fluorescent,Photograph,1,,,,,,,,,
34597,,2014-034970,SPM027267,"Lomographa vestaliata","White Spring Moth",Iowa,Linn,2012-05-18,,"Matsell Bridge Natural Area",42.13131,-91.38886,"Jim Durbin",adult,Blacklight/Fluorescent,Photograph,1,,,,,,,,,
34598,,2014-034971,SPM027347,"Lomographa vestaliata","White Spring Moth",Iowa,Linn,2012-05-21,,"Matsell Bridge Natural Area",42.13131,-91.38886,"Jim Durbin",adult,Blacklight/Fluorescent,Photograph,1,,,,,,,,,
34602,,2014-034975,SPM028615,"Lomographa vestaliata","White Spring Moth",Iowa,Linn,2012-06-15,,"Matsell Bridge Natural Area",42.13131,-91.38886,"Jim Durbin",adult,Blacklight/Fluorescent,Photograph,1,,,,,,,,,
34603,,2014-034976,SPM028647,"Lomographa vestaliata","White Spring Moth",Iowa,Linn,2012-06-15,,"Matsell Bridge Natural Area",42.13131,-91.38886,"Jim Durbin",adult,Blacklight/Fluorescent,Photograph,1,,,,,,,,,
34605,,2014-034978,SPM030907,"Lomographa vestaliata","White Spring Moth",Iowa,Linn,2012-07-22,,"Wakpicada Natural Area",42.18892,-91.52035,"Jim Durbin",adult,Blacklight/Fluorescent,Photograph,1,,,,,,,,,
34611,,2014-034984,SPM034052,"Lomographa vestaliata","White Spring Moth",Iowa,Linn,2013-06-18,,"Matsell Bridge Natural Area",42.13131,-91.38886,"Jim Durbin",adult,Blacklight/Fluorescent,Photograph,1,,,,,,,,,
34614,"Frank Olsen Drawer 45",2014-034987,SPM036682,"Lomographa vestaliata","White Spring Moth",Iowa,Linn,2013-07-29,,"Matsell Bridge Natural Area",42.13131,-91.38886,"Frank Olsen",adult,,Pinned,1,,,,,,,,,"Located at Iowa State"
34616,,2014-034989,SPM040246,"Lomographa vestaliata","White Spring Moth",Iowa,Linn,2014-06-08,,"Pleasant Creek State Recreation Area, Linn County",42.10948,-91.8249,"Jim Durbin",adult,Blacklight/Fluorescent,Photograph,1,,,,,,,,,
34617,,2014-034990,SPM040269,"Lomographa vestaliata","White Spring Moth",Iowa,Linn,2014-06-08,,"Pleasant Creek State Recreation Area, Linn County",42.10948,-91.8249,"Jim Durbin",adult,Blacklight/Fluorescent,Photograph,1,,,,,,,,,
34618,,2014-034991,SPM040305,"Lomographa vestaliata","White Spring Moth",Iowa,Linn,2014-06-10,,"Pleasant Creek State Recreation Area, Linn County",42.10948,-91.8249,"Jim Durbin",adult,Blacklight/Fluorescent,Photograph,1,,,,,,,,,
34619,,2014-034992,SPM040337,"Lomographa vestaliata","White Spring Moth",Iowa,Linn,2014-06-10,,"Pleasant Creek State Recreation Area, Linn County",42.10948,-91.8249,"Jim Durbin",adult,Blacklight/Fluorescent,Photograph,1,,,,,,,,,
34620,,2014-034993,SPM040684,"Lomographa vestaliata","White Spring Moth",Iowa,Linn,2014-06-17,,"Pleasant Creek State Recreation Area, Linn County",42.10948,-91.8249,"Jim Durbin",adult,Blacklight/Fluorescent,Photograph,1,,,,,,,,,
34621,,2014-034994,SPM040881,"Lomographa vestaliata","White Spring Moth",Iowa,Linn,2014-06-17,,"Pleasant Creek State Recreation Area, Linn County",42.10948,-91.8249,"Jim Durbin",adult,Blacklight/Fluorescent,Photograph,1,,,,,,,,,
34622,,2014-034995,SPM041497,"Lomographa vestaliata","White Spring Moth",Iowa,Linn,2014-06-24,,"Pleasant Creek State Recreation Area, Linn County",42.10948,-91.8249,"Jim Durbin",adult,Blacklight/Fluorescent,Photograph,1,,,,,,,,,
34623,,2014-034996,SPM041520,"Lomographa vestaliata","White Spring Moth",Iowa,Linn,2014-06-24,,"Pleasant Creek State Recreation Area, Linn County",42.10948,-91.8249,"Jim Durbin",adult,Blacklight/Fluorescent,Photograph,1,,,,,,,,,
37612,,2014-037986,SPM030155,"Lomographa vestaliata","White Spring Moth",Iowa,Linn,2012-07-08,,"Wanatee County Park",42.0094,-91.56623,"Jim Durbin",adult,Blacklight/Fluorescent,Pinned,1,,,,,,,,,
126454,,2015-017022,,"Lomographa vestaliata","White Spring Moth",Iowa,Linn,2015-06-05,2100-2315,"Wanatee County Park",42.01026,-91.57381,"Jim Durbin",adult,Blacklight/Fluorescent,Photograph,1,78,79,58,16,90,30.1,clear,"90% Moon visible",
126813,,2015-017381,,"Lomographa vestaliata","White Spring Moth",Iowa,Linn,2015-06-10,2100-2315,"Pleasant Creek State Recreation Area, Linn County",42.109952,-91.822641,"Jim Durbin",adult,Blacklight/Fluorescent,Photograph,1,82,41,56,6,45,29.75,clear,"40% visible",
126840,,2015-017408,,"Lomographa vestaliata","White Spring Moth",Iowa,Linn,2015-06-10,2100-2315,"Pleasant Creek State Recreation Area, Linn County",42.109952,-91.822641,"Jim Durbin",adult,Blacklight/Florescent,Photograph,1,82,41,56,6,45,29.75,clear,"40% visible",
126863,,2015-017431,,"Lomographa vestaliata","White Spring Moth",Iowa,Linn,2015-06-10,2100-2315,"Pleasant Creek State Recreation Area, Linn County",42.109952,-91.822641,"Jim Durbin",adult,Blacklight/Florescent,Photograph,1,82,41,56,6,45,29.75,clear,"40% visible",
127700,,2015-018290,,"Lomographa vestaliata","White Spring Moth",Iowa,Linn,2015-06-23,,"Matsell Bridge Natural Area",42.131959,-91.388307,"Jim Durbin",adult,Blacklight/Fluorescent,Photograph,1,,,,,,,,,
143733,,2016-008913,,"Lomographa vestaliata","White Spring Moth",Iowa,Linn,1985-06-29,,"Boyson Park",42.041516,-91.621167,"Frank Olsen",adult,,Sighting,1,,,,,,,,,
169060,,2016-033805,,"Lomographa vestaliata","White Spring Moth",Iowa,Linn,2016-06-08,2048-2300,"Hitaga Sand Ridge Prairie Preserve",42.250957,-91.632098,"Jim Durbin",adult,Blacklight/Fluorescent,Photograph,1,75,48,53,0,120,29.88,cloudy,"10% visible",
232272,,2019-006985,,"Lomographa vestaliata","White Spring Moth",Iowa,Linn,2019-06-23,2100-2315,"Matsell Bridge Natural Area",42.132148,-91.385221,"Jim Durbin",adult,Blacklight/Fluorescent,Photograph,1,73.0,73.0,64.0,2.0,190,29.54,cloudy,"90% visible",
232565,,2019-007278,,"Lomographa vestaliata","White Spring Moth",Iowa,Linn,2019-06-26,"50% visible","Hitaga Sand Ridge Prairie Preserve",42.250957,-91.632098,"Jim Durbin",adult,Blacklight/Fluorescent,Photograph,1,79,69,68,1,100,29.79,clear,,
232632,,2019-007345,,"Lomographa vestaliata","White Spring Moth",Iowa,Linn,2019-06-26,"50% visible","Hitaga Sand Ridge Prairie Preserve",42.250957,-91.632098,"Jim Durbin",adult,Blacklight/Fluorescent,Photograph,1,79,69,68,1,100,29.79,clear,,
235774,,,,"Lomographa vestaliata","White Spring Moth",Iowa,Linn,2019-08-11,2030-2300,"Wickiup Hill Outdoor Learning Area",42.087343,-91.767109,"Jim Durbin",adult,Sighting,Photograph,1,75,90,72,4,90,29.81,"parthly cloudy","90% visible",
247626,,,,"Lomographa vestaliata","White Spring Moth",Iowa,Linn,2018-06-01,,"Chain Lakes County Park",42.059065,-91.763772,"Don Ohde",adult,Sighting,Photograph,1,,,,,,,,,
266811,,,,"Lomographa vestaliata","White Spring Moth",Iowa,Linn,2020-06-12,20:34:10,"Hitaga Sand Ridge Prairie Preserve",42.2508675,-91.63209427,"Jim Durbin",adult,Blacklight/Fluorescent,Photograph,1,76,48,55,0,0,30.17,"partly cloudy","80% visible",
266933,,,,"Lomographa vestaliata","White Spring Moth",Iowa,Linn,2020-06-12,21:35:28,"Hitaga Sand Ridge Prairie Preserve",42.2508675,-91.63209427,"Jim Durbin",adult,Blacklight/Fluorescent,Photograph,1,76,48,55,0,0,30.17,"partly cloudy","80% visible",
267770,,,,"Lomographa vestaliata","White Spring Moth",Iowa,Linn,2020-06-28,23:07:02,"Wickiup Hill Outdoor Learning Area",42.08735076,-91.76706884,"Jim Durbin",adult,Blacklight/Fluorescent,Photograph,1,78,76,70,4,110,29.57,clear,"50% visible",
268026,,,,"Lomographa vestaliata","White Spring Moth",Iowa,Linn,2020-06-28,21:54:54,"Wickiup Hill Outdoor Learning Area",42.08735076,-91.76706884,"Jim Durbin",adult,Blacklight/Fluorescent,Photograph,1,78,76,70,4,110,29.57,clear,"50% visible",
268027,,,,"Lomographa vestaliata","White Spring Moth",Iowa,Linn,2020-06-28,21:54:51,"Wickiup Hill Outdoor Learning Area",42.08735076,-91.76706884,"Jim Durbin",adult,Blacklight/Fluorescent,Photograph,1,78,76,70,4,110,29.57,clear,"50% visible",
268061,,,,"Lomographa vestaliata","White Spring Moth",Iowa,Linn,2020-06-28,21:45:19,"Wickiup Hill Outdoor Learning Area",42.08735076,-91.76706884,"Jim Durbin",adult,Blacklight/Fluorescent,Photograph,1,78,76,70,4,110,29.57,clear,"50% visible",
268062,,,,"Lomographa vestaliata","White Spring Moth",Iowa,Linn,2020-06-28,21:45:16,"Wickiup Hill Outdoor Learning Area",42.08735076,-91.76706884,"Jim Durbin",adult,Blacklight/Fluorescent,Photograph,1,78,76,70,4,110,29.57,clear,"50% visible",
268236,,,,"Lomographa vestaliata","White Spring Moth",Iowa,Linn,2020-06-30,22:34:00,"Hitaga Sand Ridge Prairie Preserve",42.25088735,-91.63212362,"Jim Durbin",adult,Blacklight/Fluorescent,Photograph,1,78,88,74,2,100,29.85,cloudy,"80% visible",
268327,,,,"Lomographa vestaliata","White Spring Moth",Iowa,Linn,2020-06-30,21:57:57,"Hitaga Sand Ridge Prairie Preserve",42.25088735,-91.63212362,"Jim Durbin",adult,Blacklight/Fluorescent,Photograph,1,78,88,74,2,100,29.85,cloudy,"80% visible",
268362,,,,"Lomographa vestaliata","White Spring Moth",Iowa,Linn,2020-06-30,21:49:47,"Hitaga Sand Ridge Prairie Preserve",42.25088735,-91.63212362,"Jim Durbin",adult,Blacklight/Fluorescent,Photograph,1,78,88,74,2,100,29.85,cloudy,"80% visible",
275050,"Jim Durbin Drawer 057",2020-000779,,"Lomographa vestaliata","White Spring Moth",Iowa,Linn,2011-06-04,,"Rock Island Botanical State Preserve",42.02732,-91.72723,"Tom Jantscher",adult,,Pinned,1,,,,,,,,,
288417,,,,"Lomographa vestaliata","White Spring Moth",Iowa,Linn,2021-06-12,22:46:30,"Pleasant Creek State Recreation Area, Linn County",42.11007461,-91.82771882,"Jim Durbin",adult,Blacklight/Fluorescent,Photograph,1,78,30,45,4,0,29.88,clear,"10% visible",
288462,,,,"Lomographa vestaliata","White Spring Moth",Iowa,Linn,2021-06-12,22:23:16,"Pleasant Creek State Recreation Area, Linn County",42.11007461,-91.82771882,"Jim Durbin",adult,Blacklight/Fluorescent,Photograph,1,78,30,45,4,0,29.88,clear,"10% visible",
290378,,,,"Lomographa vestaliata","White Spring Moth",Iowa,Linn,2021-07-08,22:25:58,"Hitaga Sand Ridge Prairie Preserve",42.25145774,-91.63021403,"Jim Durbin",adult,Blacklight/Fluorescent,Photograph,1,69,73,60,5,90,29.89,"partly cloudy","5% visible",
311091,,,,"Lomographa vestaliata","White Spring Moth",Iowa,Linn,2022-06-28,22:06:17,"Hitaga Sand Ridge Prairie Preserve",42.2510735,-91.63217209,"Jim Durbin",adult,Blacklight/Fluorescent,Photograph,1,75,50,56,6,270,30.04,"partly cloudy","new moon",
311857,,,,"Lomographa vestaliata","White Spring Moth",Iowa,Linn,2022-07-12,22:22:08,"Matsell Bridge Natural Area",42.13222612,-91.38533045,"Jim Durbin",adult,Sighting,Photograph,1,73,80,67,0,0,29.93,clear,"full moon",
336134,,,,"Lomographa vestaliata","White Spring Moth",Iowa,Linn,2023-06-29,22:12:00,"Indian Creek Nature Center",41.96608977,-91.58982624,"Jim Durbin",adult,Blacklight/Fluorescent,Photograph,1,76,92,74,0,330,29.88,hazy,"50% visible",
336435,,,,"Lomographa vestaliata","White Spring Moth",Iowa,Linn,2023-07-03,21:42:01,"Hitaga Sand Ridge Prairie Preserve",42.250717995,-91.632138603333,"Jim Durbin",adult,Blacklight/Fluorescent,Photograph,1,80,77,72,0,0,29.92,clear,"full moon",
336438,,,,"Lomographa vestaliata","White Spring Moth",Iowa,Linn,2023-07-03,21:42:31,"Hitaga Sand Ridge Prairie Preserve",42.250717995,-91.632138603333,"Jim Durbin",adult,Blacklight/Fluorescent,Photograph,1,80,77,72,0,0,29.92,clear,"full moon",
336440,,,,"Lomographa vestaliata","White Spring Moth",Iowa,Linn,2023-07-03,21:42:33,"Hitaga Sand Ridge Prairie Preserve",42.250717995,-91.632138603333,"Jim Durbin",adult,Blacklight/Fluorescent,Photograph,1,80,77,72,0,0,29.92,clear,"full moon",
336631,,,,"Lomographa vestaliata","White Spring Moth",Iowa,Linn,2023-07-03,23:29:06,"Hitaga Sand Ridge Prairie Preserve",42.250717995,-91.632138603333,"Jim Durbin",adult,Blacklight/Fluorescent,Photograph,1,80,77,72,0,0,29.92,clear,"full moon",
336685,,,,"Lomographa vestaliata","White Spring Moth",Iowa,Linn,2023-07-03,23:27:23,"Hitaga Sand Ridge Prairie Preserve",42.250717995,-91.632138603333,"Jim Durbin",adult,Blacklight/Fluorescent,Photograph,1,80,77,72,0,0,29.92,clear,"full moon",
338022,,,,"Lomographa vestaliata","White Spring Moth",Iowa,Linn,2023-07-16,23:13:12,"Matsell Bridge Natural Area",42.13217249,-91.38522877,"Jim Durbin",adult,Blacklight/Fluorescent,Photograph,1,73,70,63,4,220,29.87,cloudy,"10% visible",
