ID,"Collection / Source","Catalog Number","Specify Number",Taxon,"Common Name",State,County,Date,Time,Locale,Latitude,Longitude,Collector,"Life Stage","Collection Method","Preparation Type",Count,Temperature,Humidity,"Dew Point",Wind,"Wind Direction","Barometric Pressure",Sky,"Moon Phase",Notes
1336,,2014-001336,,"Pyrausta generosa",None,Iowa,Linn,2014-07-31,,"Pleasant Creek State Recreation Area, Linn County",42.110327,-91.822988,"Jim Durbin",adult,Blacklight/Fluorescent,Photograph,1,,,,,,,,,
1341,,2014-001341,,"Pyrausta generosa",None,Iowa,Linn,2014-07-31,,"Pleasant Creek State Recreation Area, Linn County",42.110327,-91.822988,"Jim Durbin",adult,Blacklight/Fluorescent,Photograph,1,,,,,,,,,
44418,"Jim Durbin Drawer 040",2014-044795,SPM000703,"Pyrausta generosa",None,Iowa,Linn,2004-05-03,,"Wickiup Hill Outdoor Learning Area",42.08398,-91.7651,"Jim Durbin",adult,Blacklight/Fluorescent,Pinned,1,,,,,,,,,
44420,"Jim Durbin Drawer 040",2014-044797,SPM004683,"Pyrausta generosa",None,Iowa,Linn,2005-06-26,,"Wanatee County Park",42.0094,-91.56623,"Jim Durbin",adult,Blacklight/Fluorescent,Pinned,1,,,,,,,,,
44429,"Jim Durbin Drawer 040",2014-044806,SPM019072,"Pyrausta generosa",None,Iowa,Linn,2010-07-31,,"Wickiup Hill Outdoor Learning Area",42.08398,-91.7651,"Tom Jantscher",adult,,Pinned,1,,,,,,,,,
44430,,2014-044807,SPM023845,"Pyrausta generosa",None,Iowa,Linn,2011-07-03,,"Pleasant Creek State Recreation Area, Linn County",42.11952,-91.81215,"Jim Durbin",adult,Blacklight/Fluorescent,Photograph,1,,,,,,,,,
44432,"Jim Durbin Drawer 040",2014-044809,SPM029146,"Pyrausta generosa",None,Iowa,Linn,2012-06-22,,"Behren's Pond Woodland State Preserve",42.118214,-91.754324,"Jim Durbin",adult,Blacklight/Fluorescent,Pinned,1,,,,,,,,,
44435,"Frank Olsen Drawer 48",2014-044812,SPM032275,"Pyrausta generosa",None,Iowa,Linn,2012-08-14,,"Wickiup Hill Outdoor Learning Area",42.08398,-91.7651,"Frank Olsen",adult,,Pinned,1,,,,,,,,,"Located at Iowa State"
44436,"Frank Olsen Drawer 48",2014-044813,SPM032813,"Pyrausta generosa",None,Iowa,Linn,2012-06-18,,"Rock Island Botanical State Preserve",42.02732,-91.72723,"Frank Olsen",adult,,Pinned,1,,,,,,,,,"Located at Iowa State"
44437,"Frank Olsen Drawer 48",2014-044814,SPM036506,"Pyrausta generosa",None,Iowa,Linn,2013-06-11,,"Wickiup Hill Outdoor Learning Area",42.08398,-91.7651,"Frank Olsen",adult,,Pinned,1,,,,,,,,,"Located at Iowa State"
71822,"Frank Olsen Drawer 48",2014-072429,,"Pyrausta generosa",None,Iowa,Linn,2014-06-20,,"Wickiup Hill Outdoor Learning Area",42.08398,-91.7651,"Frank Olsen",adult,,Pinned,1,,,,,,,,,"Located at Iowa State"
126883,,2015-017451,,"Pyrausta generosa",None,Iowa,Linn,2015-06-10,2100-2315,"Pleasant Creek State Recreation Area, Linn County",42.109952,-91.822641,"Jim Durbin",adult,Blacklight/Florescent,Photograph,1,82,41,56,6,45,29.75,clear,"40% visible",
168117,,2016-032862,,"Pyrausta generosa",None,Iowa,Linn,2016-05-31,1030-2300,"Hitaga Sand Ridge Prairie Preserve",42.250957,-91.632098,"Jim Durbin",adult,Blacklight/Florescent,Photograph,1,66,100,65,0,0,29.89,cloudy,"30% visible","1030-2300. Rained for about 45 minutes."
168689,,2016-033434,,"Pyrausta generosa",None,Iowa,Linn,2016-06-05,2045-2300,"Vecny Woods",41.956725,-91.600854,"Jim Durbin",adult,Blacklight/Fluorescent,Photograph,1,80,36,51,4,300,29.67,"partly cloudy","dark phase",
171014,,2016-035759,,"Pyrausta generosa",None,Iowa,Linn,2016-06-27,2100-2330,"Hitaga Sand Ridge Prairie Preserve",42.250957,-91.632098,"Jim Durbin",adult,Blacklight/Fluorescent,Photograph,1,77,59,62,4,300,30.06,"partly cloudy","50% visible",
171035,,2016-035780,,"Pyrausta generosa",None,Iowa,Linn,2016-06-27,2100-2330,"Hitaga Sand Ridge Prairie Preserve",42.250957,-91.632098,"Jim Durbin",adult,Blacklight/Fluorescent,Photograph,1,77,59,62,4,300,30.06,"partly cloudy","50% visible",
171667,"Jim Durbin Drawer 040",2016-036412,,"Pyrausta generosa",None,Iowa,Linn,2016-07-09,2100-2330,"Hitaga Sand Ridge Prairie Preserve",42.250957,-91.632098,"Jim Durbin",adult,Blacklight/Fluorescent,Pinned,1,72,83,66,0,0,30.01,clear,"30% visible",
171908,,2016-036653,,"Pyrausta generosa",None,Iowa,Linn,2016-07-14,2100-2330,"Hitaga Sand Ridge Prairie Preserve",42.250957,-91.632098,"Jim Durbin",adult,Blacklight/Fluorescent,Photograph,1,71,74,62,2,345,29.92,clear,"80% visible",
171915,,2016-036660,,"Pyrausta generosa",None,Iowa,Linn,2016-07-14,2100-2330,"Hitaga Sand Ridge Prairie Preserve",42.250957,-91.632098,"Jim Durbin",adult,Blacklight/Fluorescent,Photograph,1,71,74,62,2,345,29.92,clear,"80% visible",
171984,,2016-036729,,"Pyrausta generosa",None,Iowa,Linn,2016-07-14,2100-2330,"Hitaga Sand Ridge Prairie Preserve",42.250957,-91.632098,"Jim Durbin",adult,Blacklight/Fluorescent,Photograph,1,71,74,62,2,345,29.92,clear,"80% visible",
172021,,2016-036766,,"Pyrausta generosa",None,Iowa,Linn,2016-07-14,2100-2330,"Hitaga Sand Ridge Prairie Preserve",42.250957,-91.632098,"Jim Durbin",adult,Blacklight/Fluorescent,Photograph,1,71,74,62,2,345,29.92,clear,"80% visible",
173139,,2016-037885,,"Pyrausta generosa",None,Iowa,Linn,2016-07-30,2100-2330,"Hitaga Sand Ridge Prairie Preserve",42.250957,-91.632098,"Jim Durbin",adult,Blacklight/Fluorescent,Photograph,1,72,87,68,0,0,29.92,"partly cloudy","10% visible",
173333,,2016-038079,,"Pyrausta generosa",None,Iowa,Linn,2016-08-03,2100-2330,"Hitaga Sand Ridge Prairie Preserve",42.250957,-91.632098,"Jim Durbin",adult,Blacklight/Fluorescent,Photograph,1,81,74,71,3,180,29.96,clear,Dark,
173918,,2016-038673,,"Pyrausta generosa",None,Iowa,Linn,2016-08-09,2030-2300,"Hitaga Sand Ridge Prairie Preserve",42.250957,-91.632098,"Jim Durbin",adult,Blacklight/Fluorescent,Photograph,1,79,79,71,0,0,29.96,clear,"40% visible",
173984,,2016-038739,,"Pyrausta generosa",None,Iowa,Linn,2016-08-09,2030-2300,"Hitaga Sand Ridge Prairie Preserve",42.250957,-91.632098,"Jim Durbin",adult,Blacklight/Fluorescent,Photograph,1,79,79,71,0,0,29.96,clear,"40% visible",
174047,,2016-038802,,"Pyrausta generosa",None,Iowa,Linn,2016-08-09,2030-2300,"Hitaga Sand Ridge Prairie Preserve",42.250957,-91.632098,"Jim Durbin",adult,Blacklight/Fluorescent,Photograph,1,79,79,71,0,0,29.96,clear,"40% visible",
191945,,2017-009906,,"Pyrausta generosa",None,Iowa,Linn,2017-05-31,2030-2300,"Hitaga Sand Ridge Prairie Preserve",42.250957,-91.632098,"Jim Durbin",adult,Blacklight/Fluorescent,Photograph,1,65,43,42,5,0,29.98,clear,"40% visible",
191961,,2017-009922,,"Pyrausta generosa",None,Iowa,Linn,2017-05-31,2030-2300,"Hitaga Sand Ridge Prairie Preserve",42.250957,-91.632098,"Jim Durbin",adult,Blacklight/Fluorescent,Photograph,1,65,43,42,5,0,29.98,clear,"40% visible",
191968,,2017-009929,,"Pyrausta generosa",None,Iowa,Linn,2017-05-31,2030-2300,"Hitaga Sand Ridge Prairie Preserve",42.250957,-91.632098,"Jim Durbin",adult,Blacklight/Fluorescent,Photograph,1,65,43,42,5,0,29.98,clear,"40% visible",
194128,,2017-012094,,"Pyrausta generosa",None,Iowa,Linn,2017-07-22,2045-2330,"Hitaga Sand Ridge Prairie Preserve",42.250957,-91.632098,"Jim Durbin",adult,Blacklight/Fluorescent,Photograph,1,80,94,78,2,330,29.85,"partly cloudy","10 % visible",
194324,,2017-012290,,"Pyrausta generosa",None,Iowa,Linn,2017-07-22,2045-2330,"Hitaga Sand Ridge Prairie Preserve",42.250957,-91.632098,"Jim Durbin",adult,Blacklight/Fluorescent,Photograph,1,80,94,78,2,330,29.85,"partly cloudy","10 % visible",
194473,,2017-012438,,"Pyrausta generosa",None,Iowa,Linn,2017-07-29,2045-2315,"Hitaga Sand Ridge Prairie Preserve",42.250957,-91.632098,"Jim Durbin",adult,Blacklight/Fluorescent,Photograph,1,69,73,61,0,0,30.09,clear,"40% visible",
194486,,2017-012451,,"Pyrausta generosa",None,Iowa,Linn,2017-07-29,2045-2315,"Hitaga Sand Ridge Prairie Preserve",42.250957,-91.632098,"Jim Durbin",adult,Blacklight/Fluorescent,Photograph,1,69,73,61,0,0,30.09,clear,"40% visible",
194496,,2017-012461,,"Pyrausta generosa",None,Iowa,Linn,2017-07-29,2045-2315,"Hitaga Sand Ridge Prairie Preserve",42.250957,-91.632098,"Jim Durbin",adult,Blacklight/Fluorescent,Photograph,1,69,73,61,0,0,30.09,clear,"40% visible",
194627,,2017-012592,,"Pyrausta generosa",None,Iowa,Linn,2017-07-29,2045-2315,"Hitaga Sand Ridge Prairie Preserve",42.250957,-91.632098,"Jim Durbin",adult,Blacklight/Fluorescent,Photograph,1,69,73,61,0,0,30.09,clear,"40% visible",
200127,,2017-018058,,"Pyrausta generosa",None,Iowa,Linn,2016-07-14,,"Hitaga Sand Ridge Prairie Preserve",42.250957,-91.632098,"Don F. Becker",adult,,Photograph,1,,,,,,,,,
200218,,2017-018149,,"Pyrausta generosa",None,Iowa,Linn,2016-08-03,,"Hitaga Sand Ridge Prairie Preserve",42.250957,-91.632098,"Don F. Becker",adult,,Photograph,1,,,,,,,,,
200293,,2017-018224,,"Pyrausta generosa",None,Iowa,Linn,2016-08-09,,"Hitaga Sand Ridge Prairie Preserve",42.250957,-91.632098,"Don F. Becker",adult,,Photograph,1,,,,,,,,,
211896,,2018-010053,,"Pyrausta generosa",None,Iowa,Linn,2018-06-06,2030-2315,"Wickiup Hill Outdoor Learning Area",42.087352,-91.767107,"Jim Durbin",adult,Blacklight/Fluorescent,Photograph,1,74,69,64,5,280,29.83,cloudy,"50% visible",
212027,,2018-010184,,"Pyrausta generosa",None,Iowa,Linn,2018-06-11,2100-2300,"Hitaga Sand Ridge Prairie Preserve",42.250957,-91.632098,"Jim Durbin",adult,Blacklight/Fluorescent,Photograph,1,68,84,63,7,90,29.89,cloudy,"10% visible",
212090,,2018-010247,,"Pyrausta generosa",None,Iowa,Linn,2018-06-11,2100-2300,"Hitaga Sand Ridge Prairie Preserve",42.250957,-91.632098,"Jim Durbin",adult,Blacklight/Fluorescent,Photograph,1,68,84,63,7,90,29.89,cloudy,"10% visible",
212191,,2018-010348,,"Pyrausta generosa",None,Iowa,Linn,2018-06-11,2100-2300,"Hitaga Sand Ridge Prairie Preserve",42.250957,-91.632098,"Jim Durbin",adult,Blacklight/Fluorescent,Photograph,1,68,84,63,7,90,29.89,cloudy,"10% visible",
218563,,2018-016719,,"Pyrausta generosa",None,Iowa,Linn,2018-08-11,2030-2300,"Hitaga Sand Ridge Prairie Preserve",42.250604,-91.629962,"Jim Durbin",adult,Blacklight/Fluorescent,Photograph,1,74,81,68,5,45,30.06,clear,dark,
219250,,2018-017406,,"Pyrausta generosa",None,Iowa,Linn,2018-08-17,,"Prairiewoods Franciscan Spirituality Center",42.048527,-91.67118,"Frank Olsen",adult,,Sighting,1,80,,,6,0,,,,
219624,,2018-017780,,"Pyrausta generosa",None,Iowa,Linn,2018-08-25,2015-2300,"Hitaga Sand Ridge Prairie Preserve",42.250604,-91.629962,"Jim Durbin",adult,Blacklight/Fluorescent,Photograph,1,74,97,73,3,310,29.91,cdlear,"Full Moon",
230423,,2019-005657,,"Pyrausta generosa",None,Iowa,Linn,2019-05-30,,"Hitaga Sand Ridge Prairie Preserve",42.250957,-91.632098,"Jim Durbin",adult,Blacklight/Fluorescent,Photograph,1,68,81,62,,,29.82,"partly cloidy","10% visible",
232663,,2019-007376,,"Pyrausta generosa",None,Iowa,Linn,2019-06-26,"50% visible","Hitaga Sand Ridge Prairie Preserve",42.250957,-91.632098,"Jim Durbin",adult,Blacklight/Fluorescent,Photograph,1,79,69,68,1,100,29.79,clear,,
234419,,,,"Pyrausta generosa",None,Iowa,Linn,2019-07-23,2100-2315,"Hitaga Sand Ridge Prairie Preserve",42.251284,-91.630087,"Jim Durbin",adult,Blacklight/Fluorescent,Photograph,1,75,56,58,3,275,30.11,clear,new,
234535,,,,"Pyrausta generosa",None,Iowa,Linn,2019-07-23,2100-2315,"Hitaga Sand Ridge Prairie Preserve",42.251284,-91.630087,"Jim Durbin",adult,Blacklight/Fluorescent,Photograph,1,75,56,58,3,275,30.11,clear,new,
236289,,,,"Pyrausta generosa",None,Iowa,Linn,2019-08-17,2030-2300,"Hitaga Sand Ridge Prairie Preserve",42.25226,-91.63040167,"Jim Durbin",adult,Blacklight/Fluorescent,Photograph,1,79,62,65,1,180,29.71,"parthly cloudy","Full Moon",
236469,,,,"Pyrausta generosa",None,Iowa,Linn,2019-08-17,2030-2300,"Hitaga Sand Ridge Prairie Preserve",42.25226,-91.63040167,"Jim Durbin",adult,Blacklight/Fluorescent,Photograph,1,79,62,65,1,180,29.71,"parthly cloudy","Full Moon",
236493,,,,"Pyrausta generosa",None,Iowa,Linn,2019-08-17,2030-2300,"Hitaga Sand Ridge Prairie Preserve",42.25226,-91.63040167,"Jim Durbin",adult,Blacklight/Fluorescent,Photograph,1,79,62,65,1,180,29.71,"parthly cloudy","Full Moon",
236494,,,,"Pyrausta generosa",None,Iowa,Linn,2019-08-17,2030-2300,"Hitaga Sand Ridge Prairie Preserve",42.25226,-91.63040167,"Jim Durbin",adult,Blacklight/Fluorescent,Photograph,1,79,62,65,1,180,29.71,"parthly cloudy","Full Moon",
266002,,,,"Pyrausta generosa",None,Iowa,Linn,2020-06-07,20:29:12,"Wickiup Hill Outdoor Learning Area",42.08736536,-91.76707659,"Jim Durbin",adult,Sighting,Photograph,1,81,49,60,4,170,29.77,clear,full,
268654,,,,"Pyrausta generosa",None,Iowa,Linn,2020-07-20,2100,"Hitaga Sand Ridge Prairie Preserve",42.250928,-91.63211,"Jim Durbin",adult,Blacklight/Fluorescent,Photograph,1,71,75,63,3,110,29.61,clear,new,
268705,,,,"Pyrausta generosa",None,Iowa,Linn,2020-07-20,2100,"Hitaga Sand Ridge Prairie Preserve",42.250928,-91.63211,"Jim Durbin",adult,Blacklight/Fluorescent,Photograph,1,71,75,63,3,110,29.61,clear,new,
269979,,,,"Pyrausta generosa",None,Iowa,Linn,2020-08-08,21:10:03,"Hitaga Sand Ridge Prairie Preserve",42.25088607,-91.63213435,"Jim Durbin",adult,Blacklight/Fluorescent,Photograph,1,78,81,71,7,180,30.02,clear,"80% visible",
286779,"Jim Durbin Drawer 040",2021-000033,,"Pyrausta generosa",None,Iowa,Linn,2005-06-01,,"Wickiup Hill Outdoor Learning Area",42.08398,-91.7651,"Jim Durbin",adult,Blacklight/Fluorescent,Pinned,1,,,,,,,,,
291285,,,,"Pyrausta generosa",None,Iowa,Linn,2021-08-06,22:01:26,"Hitaga Sand Ridge Prairie Preserve",42.25082292,-91.63215158,"Jim Durbin",adult,Blacklight/Fluorescent,Photograph,1,78,72,68,4,165,29.79,cloudy,"new moon",
291301,,,,"Pyrausta generosa",None,Iowa,Linn,2021-08-06,21:56:17,"Hitaga Sand Ridge Prairie Preserve",42.25082292,-91.63215158,"Jim Durbin",adult,Blacklight/Fluorescent,Photograph,1,78,72,68,4,165,29.79,cloudy,"new moon",
291385,,,,"Pyrausta generosa",None,Iowa,Linn,2021-08-06,21:19:27,"Hitaga Sand Ridge Prairie Preserve",42.25082292,-91.63215158,"Jim Durbin",adult,Blacklight/Fluorescent,Photograph,1,78,72,68,4,165,29.79,cloudy,"new moon",
291453,,,,"Pyrausta generosa",None,Iowa,Linn,2021-08-06,20:55:23,"Hitaga Sand Ridge Prairie Preserve",42.25082292,-91.63215158,"Jim Durbin",adult,Blacklight/Fluorescent,Photograph,1,78,72,68,4,165,29.79,cloudy,"new moon",
310988,,,,"Pyrausta generosa",None,Iowa,Linn,2022-06-28,22:41:46,"Hitaga Sand Ridge Prairie Preserve",42.2510735,-91.63217209,"Jim Durbin",adult,Blacklight/Fluorescent,Photograph,1,75,50,56,6,270,30.04,"partly cloudy","new moon",
311156,,,,"Pyrausta generosa",None,Iowa,Linn,2022-06-28,21:44:55,"Hitaga Sand Ridge Prairie Preserve",42.2510735,-91.63217209,"Jim Durbin",adult,Blacklight/Fluorescent,Photograph,1,75,50,56,6,270,30.04,"partly cloudy","new moon",
338866,,,,"Pyrausta generosa",None,Iowa,Linn,2023-07-30,21:09:08,"Hitaga Sand Ridge Prairie Preserve",42.25109448,-91.63222102,"Jim Durbin",adult,Blacklight/Fluorescent,Photograph,1,75,76,67,0,0,30.08,"mostly clear","95% moon",
338869,,,,"Pyrausta generosa",None,Iowa,Linn,2023-07-30,21:10:15,"Hitaga Sand Ridge Prairie Preserve",42.25109448,-91.63222102,"Jim Durbin",adult,Blacklight/Fluorescent,Photograph,1,75,76,67,0,0,30.08,"mostly clear","95% moon",
