ID,"Collection / Source","Catalog Number","Specify Number",Taxon,"Common Name",State,County,Date,Time,Locale,Latitude,Longitude,Collector,"Life Stage","Collection Method","Preparation Type",Count,Temperature,Humidity,"Dew Point",Wind,"Wind Direction","Barometric Pressure",Sky,"Moon Phase",Notes
181509,,2016-046421,,"Idiocerus gillettei",None,Iowa,Johnson,2016-06-22,,Redacted,Redacted,Redacted,"Mark Brown",adult,,Photograph,1,,,,,,,,,
182280,,2017-000241,,"Idiocerus raphus",None,Iowa,Johnson,2014-07-09,,Redacted,Redacted,Redacted,"Mark Brown",adult,,Photograph,1,,,,,,,,,
186115,,2017-004076,,"Idiocerus raphus",None,Iowa,Johnson,2014-07-09,,Redacted,Redacted,Redacted,"Mark Brown",adult,,Photograph,1,,,,,,,,,
201978,,2018-000124,,"Idiocerus raphus",None,Iowa,Johnson,2017-06-28,,Redacted,Redacted,Redacted,"Mark Brown",adult,,Photograph,1,,,,,,,,,
202428,,2018-000574,,"Idiocerus pallidus",None,Iowa,Johnson,2012-07-04,,"Iowa City",41.667,-91.545,"Mark Brown",adult,,Photograph,1,,,,,,,,,
202512,,2018-000658,,"Idiocerus raphus",None,Iowa,Johnson,2017-06-28,,Redacted,Redacted,Redacted,"Mark Brown",adult,,Photograph,1,,,,,,,,,
296261,,,,"Idiocerus raphus",None,Iowa,Johnson,2021-06-19,6:39:25,Redacted,Redacted,Redacted,"Mark Brown",adult,Sighting,Photograph,1,,,,,,,,,
298990,,,,"Idiocerus albolinea",None,Iowa,Johnson,2021-09-28,,Redacted,Redacted,Redacted,"Mark Brown",adult,"Building Light",Photograph,1,,,,,,,,,
343566,,,,"Idiocerus raphus",None,Iowa,Johnson,2023-07-06,21:59:45,Redacted,Redacted,Redacted,"Mark Brown",adult,Sighting,Photograph,1,,,,,,,,,
