ID,"Collection / Source","Catalog Number","Specify Number",Taxon,"Common Name",State,County,Date,Time,Locale,Latitude,Longitude,Collector,"Life Stage","Collection Method","Preparation Type",Count,Temperature,Humidity,"Dew Point",Wind,"Wind Direction","Barometric Pressure",Sky,"Moon Phase",Notes
66116,,2014-066720,,"Megalodacne heros",None,Iowa,Johnson,2014-06-21,,Redacted,Redacted,Redacted,"Mark Brown",adult,,Photograph,1,,,,,,,,,
110188,,2015-000744,,"Megalodacne faciata",None,Iowa,Johnson,2014-08-18,,"Along Manitou Trail-x",41.68435,-91.55424,"Mark Brown",adult,,Photograph,1,,,,,,,,,
136403,,2016-000945,,"Languria trifasciata",None,Iowa,Johnson,2015-06-18,,"Hawkeye Willdlife Management Area",41.77465,-91.71518,"Mark Brown",adult,,Photograph,1,,,,,,,,,
136463,,2016-001005,,"Tritoma sanguinipennis","Red-winged Tritoma",Iowa,Johnson,2015-05-16,,"Hickory Hill Park",41.671722,-91.510372,"Mark Brown",adult,,Photograph,1,,,,,,,,,
137456,,2016-001999,,"Toramus pulchellus",None,Iowa,Johnson,2015-05-02,,"Hawkeye Willdlife Management Area",41.77465,-91.71518,"Mark Brown",adult,,Photograph,1,,,,,,,,,
137548,,2016-002091,,"Ischyrus quadripunctatus","Four-Spotted Fungus Beetle",Iowa,Johnson,2014-05-27,,Redacted,Redacted,Redacted,"Mark Brown",adult,,Photograph,1,,,,,,,,,
137818,,2016-002362,,"Languria mozardi",None,Iowa,Johnson,2011-06-26,,"Terry Trueblood Recreation Area",41.624583,-91.528054,"Mark Brown",adult,,Photograph,1,,,,,,,,,
182290,,2017-000251,,"Megalodacne faciata",None,Iowa,Johnson,2014-08-18,,Coralville,41.680218,-91.599614,"Mark Brown",adult,,Photograph,1,,,,,,,,,
186142,,2017-004103,,"Megalodacne faciata",None,Iowa,Johnson,2014-08-18,,"Along Manitou Trail-x",41.68435,-91.55424,"Mark Brown",adult,,Photograph,1,,,,,,,,,
186907,,2017-004868,,"Ischyrus quadripunctatus","Four-Spotted Fungus Beetle",Iowa,Johnson,2017-04-25,,Redacted,Redacted,Redacted,"Mark Brown",adult,,Photograph,1,,,,,,,,,
219806,,2018-018233,,"Ischyrus quadripunctatus","Four-Spotted Fungus Beetle",Iowa,Johnson,2018-05-14,,Redacted,Redacted,Redacted,"Mark Brown",adult,,Photograph,1,,,,,,,,,
238452,,,,"Ischyrus quadripunctatus","Four-Spotted Fungus Beetle",Iowa,Johnson,2019-08-21,,"Sugar Bottom Recreational Area",41.761676,-91.554925,"Mark Brown",adult,"Building Light",Photograph,1,,,,,,,,,
272386,,,,"Ischyrus quadripunctatus","Four-Spotted Fungus Beetle",Iowa,Johnson,2020-08-24,23:07:22,Redacted,Redacted,Redacted,"Mark Brown",adult,Sighting,Photograph,1,,,,,,,,,
287023,,,,"Triplax flavicollis",None,Iowa,Johnson,2020-06-06,,"F. W. Kent Park",41.7266792,-91.73239629,"Mark Brown",adult,Sighting,Photograph,1,,,,,,,,,
287241,,,,"Triplax flavicollis",None,Iowa,Johnson,2020-06-20,,"F. W. Kent Park",41.736329,-91.721945,"Mark Brown",adult,Sighting,Photograph,1,,,,,,,,,
295279,,,,"Ischyrus quadripunctatus","Four-Spotted Fungus Beetle",Iowa,Johnson,2021-07-18,22:47:20,Redacted,Redacted,Redacted,"Mark Brown",adult,Sighting,Photograph,1,,,,,,,,,
295396,,,,"Ischyrus quadripunctatus","Four-Spotted Fungus Beetle",Iowa,Johnson,2021-07-05,22:42:05,Redacted,Redacted,Redacted,"Mark Brown",adult,Sighting,Photograph,1,,,,,,,,,
295602,,,,"Ischyrus quadripunctatus","Four-Spotted Fungus Beetle",Iowa,Johnson,2021-06-27,23:26:47,Redacted,Redacted,Redacted,"Mark Brown",adult,Sighting,Photograph,1,,,,,,,,,
298002,,,,"Acropteroxys gracilis","Slender Lizard Beetle",Iowa,Johnson,2021-07-25,,"F. W. Kent Park",41.735678,-91.722354,"Mark Brown",adult,Sighting,Photograph,1,,,,,,,,,
314660,,,,"Ischyrus quadripunctatus","Four-Spotted Fungus Beetle",Iowa,Johnson,2022-05-10,22:27:06,Redacted,Redacted,Redacted,"Mark Brown",adult,Sighting,Photograph,1,,,,,,,,,
315427,,,,"Ischyrus quadripunctatus","Four-Spotted Fungus Beetle",Iowa,Johnson,2022-05-31,22:26:32,Redacted,Redacted,Redacted,"Mark Brown",adult,Sighting,Photograph,1,,,,,,,,,
320153,,,,"Toramus pulchellus",None,Iowa,Johnson,2022-07-10,,Redacted,Redacted,Redacted,"Mark Brown",adult,Sighting,Photograph,1,,,,,,,,,
320252,,,,"Megalodacne heros",None,Iowa,Johnson,2022-07-12,,"MacBride Nature Recreation Area",41.786818,-91.568342,"Mark Brown",adult,Sighting,Photograph,1,,,,,,,,,
320606,,,,"Ischyrus quadripunctatus","Four-Spotted Fungus Beetle",Iowa,Johnson,2022-07-20,6:06:23,Redacted,Redacted,Redacted,"Mark Brown",adult,Sighting,Photograph,1,,,,,,,,,
332341,,,,"Ischyrus quadripunctatus","Four-Spotted Fungus Beetle",Iowa,Johnson,2022-08-10,22:10:55,Redacted,Redacted,Redacted,"Mark Brown",adult,Sighting,Photograph,1,,,,,,,,,
341992,,,,"Languria mozardi",None,Iowa,Johnson,2023-05-21,,"F. W. Kent Park",41.732348,-91.726823,"Mark Brown",adult,Sighting,Photograph,1,,,,,,,,,
342174,,,,"Ischyrus quadripunctatus","Four-Spotted Fungus Beetle",Iowa,Johnson,2023-05-09,21:51:59,Redacted,Redacted,Redacted,"Mark Brown",adult,Sighting,Photograph,1,,,,,,,,,
342467,,,,"Ischyrus quadripunctatus","Four-Spotted Fungus Beetle",Iowa,Johnson,2023-06-06,22:11:09,Redacted,Redacted,Redacted,"Mark Brown",adult,Sighting,Photograph,1,,,,,,,,,
