ID,"Collection / Source","Catalog Number","Specify Number",Taxon,"Common Name",State,County,Date,Time,Locale,Latitude,Longitude,Collector,"Life Stage","Collection Method","Preparation Type",Count,Temperature,Humidity,"Dew Point",Wind,"Wind Direction","Barometric Pressure",Sky,"Moon Phase",Notes
14679,"Frank Olsen Drawer 24",2014-014968,SPM002086,"Amorpha juglandis","Walnut Sphinx Moth",Iowa,Fremont,2004-07-03,,"Waubonsie State Park",40.676,-95.689,"Doug Veal",adult,,Pinned,1,,,,,,,,,"Located at Iowa State"
14722,,2014-015011,SPM018608,"Amorpha juglandis","Walnut Sphinx Moth",Iowa,Fremont,2010-08-05,,"Waubonsie State Park",40.676,-95.689,"Jim Durbin",adult,Blacklight/Fluorescent,Sighting,1,,,,,,,,,
14775,,2014-015067,SPM039327,"Amorpha juglandis","Walnut Sphinx Moth",Iowa,Fremont,2013-07-05,,"Waubonsie State Park",40.676,-95.689,"Tom Jantscher",adult,,Sighting,1,,,,,,,,,
14776,,2014-015068,SPM039329,"Amorpha juglandis","Walnut Sphinx Moth",Iowa,Fremont,2013-07-05,,"Waubonsie State Park",40.676,-95.689,"Tom Jantscher",adult,,Sighting,1,,,,,,,,,
14777,,2014-015069,SPM039330,"Amorpha juglandis","Walnut Sphinx Moth",Iowa,Fremont,2013-07-05,,"Waubonsie State Park",40.676,-95.689,"Tom Jantscher",adult,,Sighting,1,,,,,,,,,
108224,,2014-108971,,"Amorpha juglandis","Walnut Sphinx Moth",Iowa,Fremont,2014-05-24,,"Waubonsie State Park",40.676,-95.689,"Tom Jantscher",adult,,Photograph,1,68,80,,3,,," cloudy with light mist",,"High-quality rich mature woods in steep loess hills"
108240,,2014-108987,,"Amorpha juglandis","Walnut Sphinx Moth",Iowa,Fremont,2014-05-25,,"Waubonsie State Park",40.676,-95.689,"Tom Jantscher",adult,,Sighting,2,,,,,,,,,"High-quality rich mature woods in steep loess hills"
108250,,2014-108997,,"Amorpha juglandis","Walnut Sphinx Moth",Iowa,Fremont,2014-05-25,,"Waubonsie State Park",40.676,-95.689,"Tom Jantscher",adult,,Sighting,1,,,,,,,,,"High-quality rich mature woods in steep loess hills"
